program: Gaussian 09
title: 000228131
version: EM64L-G09RevD.01
frameworkgroup: C1[X(C9H10N2O)]
method: RPBEPBE
basis: SDD
operation: Freq
keyword: #p
keyword: freq=noraman
keyword: PBEPBE/SDD
title: #p freq=noraman PBEPBE/SDD
converged: YES YES NO NO
title: Mulliken charges:
elementType: O N N C C C C C C C C C H H H H H H H H H H
charge: -0.438558 -0.197584 -0.078645 0.306072 -0.377998 -0.002054 -0.230780 -0.333203 -0.350872 -0.309391 -0.222213 -0.231096 0.219896 0.229832 0.302221 0.239437 0.210968 0.226257 0.248089 0.221193 0.224799 0.343630
chargesum: 0.00000
title: Mulliken charges with hydrogens summed into heavy atoms:
elementType: O N N C C C C C C C C C
charge: -0.094928 -0.197584 -0.078645 0.306072 0.071730 -0.002054 0.071441 0.117202 -0.124615 -0.061302 -0.001020 -0.006297
polarizability: 1.55856945e+02 5.21890639e+00 1.15075072e+02 -4.26066333e+00 1.48784954e+00 5.76131713e+01
1716.lowfreq: -18.4221 -6.6992 -0.0005 -0.0002 0.0005 5.7466 22.0548 106.5953 129.3807
frequency: 18.6782 106.5735 129.3415 185.0667 221.7049 233.3414 299.4134 321.3658 416.3323 422.1405 490.6870 560.6138 566.0064 588.2591 623.9425 688.3682 750.4073 766.9277 768.4247 847.6662 850.5795 863.0093 871.3240 934.4124 943.4096 975.7555 997.6996 1007.4957 1036.1605 1078.3471 1108.4886 1158.2949 1167.2961 1176.1992 1200.7943 1253.0096 1275.7417 1303.8979 1324.5269 1339.3356 1377.2965 1380.9553 1401.5871 1440.7235 1453.0526 1458.7241 1469.9593 1471.6100 1588.7830 1624.6583 2956.5448 2977.5170 3031.4129 3095.4224 3126.3250 3138.8550 3155.5088 3171.0052 3235.8345 3564.9614
redmass: 4.1487 2.9018 5.2955 3.5278 4.3467 3.5060 1.9836 1.4270 4.1627 2.8616 4.3804 4.4036 4.2250 3.6616 4.1344 4.4519 1.3338 4.4156 4.0813 1.8053 2.1912 5.1054 1.3969 1.3754 1.9748 1.3050 2.0020 2.0206 2.6370 3.3242 1.9647 1.2541 1.3283 1.4562 1.8956 1.9317 1.4586 1.6219 1.5772 3.0052 1.3913 1.2685 2.9401 2.4552 4.6392 1.0878 2.6752 1.3851 7.0358 7.7275 1.0646 1.0690 1.0956 1.0969 1.0855 1.0901 1.0953 1.0990 1.0994 1.0664
irintensity: 1.4926 6.6191 3.6980 0.7799 4.6852 7.6564 89.1357 100.1783 15.9067 13.8377 12.5536 4.8709 0.4945 2.7042 4.2282 1.2226 108.6282 6.8397 3.1128 4.8916 8.9681 8.8810 18.6447 4.2216 6.6974 0.1639 92.5036 6.4425 1.2338 11.4946 2.8095 0.4883 13.2785 11.2611 55.5658 67.6393 3.9236 33.4088 18.6445 2.4305 1.1358 24.8363 12.0977 74.0370 4.9169 6.3645 3.0685 17.3175 1.6840 6.2830 42.6172 76.2915 22.4347 21.0107 1.5274 16.0352 26.4479 19.3947 8.8453 7.4090
temp: 298.150 k
press: 1.00000 atm
elementType: 8 7 7 6 6 6 6 6 6 6 6 6 1 1 1 1 1 1 1 1 1 1
symmnumber: 1
zpe: 460513.1 jmol-1
zpe.correction: 0.175400 hartree
zpe.thermalcorrener: 0.185585 hartree
zpe.thermalcorrenthalpy: 0.186529 hartree
zpe.thermalcorrgfe: 0.138591 hartree
zpe.sumelectzpe: -532.802771 hartree
zpe.sumelectthermal: -532.792587 hartree
zpe.sumelectthermalent: -532.791642 hartree
zpe.sumelectthermalfe: -532.839580 hartree
dipole: 2.4605 -5.0418 -0.9904
dipole: 5.6969
quadrupole: -60.5024 -72.6679 -71.3632
quadrupole: -6.1642 -4.9902 -0.1738
quadrupole: 7.6754 -4.4901 -3.1854 -6.1642 -4.9902 -0.1738
hfenergy: -532.9781713 hartree
pointgroup: C01 [X(C9H10N2O1)]
dipole: 1.0730546 1.7693583 0.8611006 debye
dipolederiv: -0.8744132 0.1312909 0.0724785 0.1411716 -0.5725899 0.1594021 0.0979388 0.1873279 -0.2051978 -0.7546891 -0.0179365 -0.0054104 -0.3966275 -0.5466829 -0.1512972 -0.0003972 -0.0849397 -0.1803729 -0.6775696 -0.1958492 -0.0732388 -0.0338824 -0.3734201 -0.0288118 -0.0217981 -0.0417587 -0.2778413 0.5827396 -0.1374292 -0.0248222 -0.0045191 -0.221163 -0.070638 0.0099882 -0.0939816 0.0330112 0.4318848 0.2392306 0.1370292 0.4404887 0.2171238 0.0502987 0.2482428 -0.022326 0.2831307 0.1256265 -0.0751083 -0.0095897 -0.3997711 0.0880086 0.0086038 -0.1229449 0.0200988 -0.0034442 0.1583735 0.2430722 0.0748989 0.476478 0.6038984 0.2001762 0.1136615 0.2049318 0.0047348 0.5376837 -0.1483092 0.016521 -0.1571922 0.5092375 -0.122172 -0.0123104 -0.1166583 0.2475212 -0.0600969 -0.0537757 -0.005696 0.0291347 0.0587453 0.0823303 0.0190748 0.0741143 -0.1681701 0.0787167 0.0026388 0.0092092 0.0446181 0.1010464 0.0736963 0.0225563 0.073743 -0.1163259 -0.0371972 0.0551597 0.0221299 -0.0203489 0.0959303 0.0802364 0.0035616 0.0873294 -0.1527107 0.065143 0.0077575 0.0128225 0.0694177 -0.1636089 0.0103225 0.0302077 0.0081067 -0.1844037 0.0135726 0.0890549 -0.0200142 -0.0246417 -0.1056842 0.019015 -0.0185138 0.0373528 0.0812725 -0.0772233 -0.0542405 -0.0552943 -0.0778858 0.0520126 0.0233758 -0.1373901 -0.042386 -0.1549085 0.1210316 0.0371451 0.0066611 0.0341881 0.1284391 -0.0107082 0.0063252 -0.0117243 0.1632866 0.0912563 0.0325625 -0.0529951 0.0565675 0.0576679 -0.031181 -0.0374905 0.0223979 -0.0894527 -0.1187133 -0.098773 -0.0148944 -0.1004172 -0.1520409 0.0100225 -0.0460049 -0.0449589 0.0827807 0.0311832 -0.1066218 -0.0396714 -0.0729475 -0.0447983 -0.0702853 -0.0338197 -0.0693156 0.1490203 0.046187 -0.0538485 -0.0203161 -0.0883846 -0.0158565 -0.0567259 -0.0303162 -0.055482 0.1465191 0.019736 0.0951336 0.0228631 0.1025888 -0.057699 -0.0622761 0.025062 -0.0629788 0.1451846 -0.1475676 0.0047747 -0.0111989 0.0079663 0.0939014 -0.021211 -0.0106938 -0.0221462 0.1587481 0.4443356 0.0040714 -0.0414718 -0.0260015 0.2475327 -0.0921731 -0.1049397 -0.0467463 0.0376183 unknown
polarizability: 155.1819482|-8.2209276|111.478142|2.3326975|15.2236005|61.8850978 unknown
InChI: InChI=1S/C9H10N2O/c12-6-5-11-7-10-8-3-1-2-4-9(8)11/h1-4,7,12H,5-6H2
charge 0 multiplicity 1
22 atoms
O  3.952861 -0.592577 -0.016491
N  0.915519 0.039772 0.083677
N  -0.20763 -1.872634 -0.51524
C  -0.454066 0.362633 0.135346
C  2.015786 0.950361 0.431613
C  -1.140162 -0.840934 -0.248319
C  0.993149 -1.31328 -0.301344
C  3.312156 0.686374 -0.355207
C  -1.141377 1.550855 0.464703
C  -2.552087 -0.858645 -0.312216
C  -2.550562 1.511271 0.39377
C  -3.245467 0.325917 0.011144
H  1.681585 1.981424 0.20683
H  2.22239 0.90253 1.521952
H  1.954228 -1.811667 -0.408288
H  3.098171 0.61525 -1.43378
H  4.008414 1.534038 -0.185544
H  -0.623173 2.46754 0.767727
H  -3.078231 -1.772361 -0.605105
H  -3.1245 2.411452 0.640742
H  -4.340098 0.340431 -0.029397
H  4.275995 -0.564649 0.919424
