program: Gaussian 09
title: 000228117
version: EM64L-G09RevD.01
frameworkgroup: C1[X(C16H21NO2)]
method: RPBEPBE
basis: SDD
operation: Freq
keyword: #p
keyword: freq=noraman
keyword: PBEPBE/SDD
title: #p freq=noraman PBEPBE/SDD
converged: YES YES NO NO
title: Mulliken charges:
elementType: O O N C C C C C C C C C C C C C C C C H H H H H H H H H H H H H H H H H H H H H
charge: -0.199039 -0.204893 -0.263082 -0.027253 -0.400972 -0.360865 -0.371700 -0.721763 -0.355629 0.064197 0.095776 0.186933 0.190520 -0.356321 -0.359482 -0.358812 -0.696784 -0.212552 -0.211971 0.238713 0.197203 0.238644 0.197089 0.197381 0.187298 0.193937 0.224738 0.251045 0.217920 0.188705 0.189535 0.194694 0.195675 0.269879 0.269808 0.215055 0.209876 0.210159 0.238225 0.238113
chargesum: 0.00000
title: Mulliken charges with hydrogens summed into heavy atoms:
elementType: O O N C C C C C C C C C C C C C C C C
charge: -0.199039 -0.204893 -0.263082 0.211459 0.034874 0.033605 0.009535 -0.028060 0.022612 0.064197 0.095776 0.186933 0.190520 0.034049 -0.089603 -0.089004 -0.061694 0.025673 0.026142
polarizability: 1.86869861e+02 4.03120122e+01 1.84092679e+02 1.77152897e+00 -2.35266314e+00 1.79564473e+02
1716.lowfreq: -19.1059 -4.8880 -0.0005 0.0004 0.0005 2.9094 19.0097 20.8305 42.0471
frequency: 18.9028 19.8981 41.9798 55.4351 66.3987 97.2945 108.8344 129.9668 137.3107 150.6128 172.2349 176.7847 197.7658 221.6101 224.5645 246.4300 252.3797 264.8491 337.6205 375.6185 398.5175 427.3813 454.9687 474.1659 500.1106 511.2079 524.6880 581.1548 659.1637 682.3422 693.5005 715.3789 721.9377 736.5019 786.7237 788.3304 796.6772 843.1146 855.2982 877.9460 887.9873 906.9181 926.3447 959.8730 974.3970 995.6021 1004.3667 1005.8445 1012.6240 1028.6329 1045.0987 1065.9286 1072.5728 1074.0391 1081.8010 1124.6607 1139.5020 1167.2369 1170.4719 1177.2773 1196.6953 1207.3973 1227.8227 1249.0842 1274.2140 1281.4293 1282.4708 1285.8240 1294.8415 1314.1138 1321.1577 1338.5802 1352.4468 1353.1858 1382.0647 1388.6104 1389.9683 1416.5953 1453.2692 1453.6883 1460.1098 1462.7201 1465.6081 1469.9444 1474.2074 1475.8861 1482.1127 1485.5762 1488.7540 1614.8807 1616.8813 1623.7718 1672.2391 2951.2345 2954.2924 2962.1005 2967.8588 2971.8668 2981.5577 2987.1317 2991.1170 2999.6480 3005.1433 3017.1844 3034.5066 3054.2710 3068.4533 3070.6522 3086.6254 3101.4387 3138.5032 3152.2606 3163.9448 3173.8178
redmass: 5.6271 4.9842 1.5279 3.4282 4.0114 3.5804 1.6852 2.7653 4.6457 3.6753 4.2938 2.5976 3.1947 1.0950 1.1269 7.1068 4.6532 3.5351 9.5711 3.3422 3.1287 3.5490 4.8925 2.8930 3.1485 3.6398 7.0889 8.4315 4.7919 6.7158 5.4920 2.7413 1.0778 1.1325 2.6397 1.6217 1.6794 4.1948 3.1141 1.4364 1.9149 1.3926 2.0571 1.2751 1.4127 2.5292 2.0903 1.3452 1.9629 3.8117 1.9841 2.4949 2.6341 2.2512 2.1122 2.7115 2.3428 1.3074 2.0616 1.9917 2.0160 2.0322 1.3514 1.3720 1.2798 1.1928 1.3250 1.1707 1.1164 1.3810 5.1302 1.4127 1.6000 1.6462 1.3190 1.2173 1.2327 6.1564 2.4849 2.7354 1.0775 1.0687 1.0751 1.0499 1.0718 1.0426 1.0773 1.0624 1.0916 8.6937 7.9191 9.5571 11.9837 1.0589 1.0589 1.0593 1.0591 1.0363 1.0623 1.0954 1.0367 1.0986 1.0865 1.1018 1.1038 1.1022 1.1007 1.0993 1.0996 1.1006 1.0864 1.0905 1.0956 1.1003
irintensity: 0.0568 0.3590 0.0272 0.7002 1.7631 2.9287 0.1817 0.8089 0.0582 1.4943 1.7980 0.7094 0.1226 0.0476 0.0085 1.0095 1.1214 1.7355 12.8809 0.6265 2.2157 0.1699 0.0034 5.2051 3.2976 0.5254 8.2658 2.5986 0.0135 4.2251 3.1900 86.8709 12.8258 1.4359 2.0642 7.2017 26.5348 10.5913 12.0471 9.7035 6.7585 0.0067 6.0441 0.7807 2.1467 3.4584 10.4993 0.0107 5.1372 14.8192 50.0375 3.0798 5.6561 4.3915 8.5546 11.4264 18.8020 2.7823 2.7644 8.3407 3.7425 4.7936 5.0568 1.3959 2.0496 0.9120 0.1748 2.8912 0.8314 19.5301 358.7618 0.8007 4.2812 3.5649 14.1133 10.1070 20.1230 12.2811 10.0669 1.0381 2.3408 0.3358 0.6483 21.1957 3.0603 12.4577 1.7246 5.5044 29.4940 169.2520 35.8914 197.0441 51.4211 0.3569 3.5417 5.8811 108.7783 37.4055 43.3215 2.7237 37.0935 3.2281 3.0232 0.7678 57.3474 59.7351 93.9369 56.0474 40.3977 15.8806 1.8157 5.6226 6.3183 21.5794
temp: 298.150 k
press: 1.00000 atm
elementType: 8 8 7 6 6 6 6 6 6 6 6 6 6 6 6 6 6 6 6 1 1 1 1 1 1 1 1 1 1 1 1 1 1 1 1 1 1 1 1 1
symmnumber: 1
zpe: 880670.1 jmol-1
zpe.correction: 0.335430 hartree
zpe.thermalcorrener: 0.354910 hartree
zpe.thermalcorrenthalpy: 0.355854 hartree
zpe.thermalcorrgfe: 0.285144 hartree
zpe.sumelectzpe: -826.118307 hartree
zpe.sumelectthermal: -826.098827 hartree
zpe.sumelectthermalent: -826.097883 hartree
zpe.sumelectthermalfe: -826.168593 hartree
dipole: -1.1888 -1.7174 -0.3512
dipole: 2.1180
quadrupole: -102.4540 -105.7650 -124.5849
quadrupole: 12.7398 1.9477 2.5316
quadrupole: 8.4807 5.1696 -13.6503 12.7398 1.9477 2.5316
hfenergy: -826.453737 hartree
pointgroup: C01 [X(C16H21N1O2)]
dipole: -0.4857099 -0.6682877 -0.1088063 debye
polarizability: 189.1413114|40.223324|181.5806911|-0.2259705|-2.1867948|179.8050102 unknown
InChI: InChI=1S/C16H21NO2/c1-3-4-5-6-9-12(2)17-15(18)13-10-7-8-11-14(13)16(17)19/h7-8,10-12H,3-6,9H2,1-2H3
charge 0 multiplicity 1
40 atoms
O  -1.136165 0.79405 2.46197
O  -0.920523 1.045033 -2.243832
N  -0.785649 1.190031 0.137145
C  0.200623 2.29424 0.281781
C  1.572149 1.912531 -0.335027
C  2.195989 0.634861 0.265524
C  3.602296 0.333539 -0.300458
C  -0.36742 3.60765 -0.298892
C  4.224379 -0.959766 0.271571
C  -1.373763 0.525508 1.257684
C  -1.260538 0.65838 -1.096059
C  -2.292076 -0.51034 0.684747
C  -2.225205 -0.430918 -0.726393
C  5.634421 -1.259171 -0.287227
C  -3.114924 -1.446096 1.328712
C  -2.98006 -1.285003 -1.543824
C  6.246266 -2.557201 0.282421
C  -3.883052 -2.316045 0.511139
C  -3.816559 -2.236552 -0.903321
H  0.321996 2.401322 1.377796
H  2.252954 2.770357 -0.161616
H  1.463418 1.805176 -1.430875
H  2.254863 0.733195 1.369482
H  1.533309 -0.231709 0.065191
H  4.275623 1.190135 -0.086296
H  3.543116 0.253575 -1.406073
H  -1.326256 3.869518 0.182506
H  -0.528688 3.520441 -1.386663
H  0.344516 4.4326 -0.116955
H  3.55526 -1.817854 0.051027
H  4.277379 -0.884367 1.377957
H  6.303977 -0.403642 -0.062596
H  5.580292 -1.328709 -1.393062
H  -3.156821 -1.497609 2.421171
H  -2.920232 -1.214154 -2.6344
H  7.254599 -2.745798 -0.130166
H  5.613487 -3.432465 0.041836
H  6.336139 -2.5023 1.383864
H  -4.537439 -3.060815 0.976722
H  -4.420781 -2.921129 -1.508314
