program: Gaussian 09
title: 000228115
version: EM64L-G09RevD.01
frameworkgroup: C1[X(C16H20N4O4)]
method: RPBEPBE
basis: SDD
operation: Freq
keyword: #p
keyword: freq=noraman
keyword: PBEPBE/SDD
title: #p freq=noraman PBEPBE/SDD
converged: YES YES NO NO
title: Mulliken charges:
elementType: O O O O N N N N C C C C C C C C C C C C C C C C H H H H H H H H H H H H H H H H H H H H
charge: -0.188927 -0.271836 -0.212889 -0.207383 0.009180 -0.438366 0.023315 0.015572 0.153282 -0.457672 -0.446141 0.391452 -0.432916 -0.759024 0.066881 -0.385958 -0.839710 -0.820619 0.297323 0.255535 -0.291809 -0.498726 -0.367979 0.446236 0.220996 0.219474 0.214963 0.215996 0.218615 0.213169 0.223051 0.228427 0.220442 0.212918 0.231488 0.230951 0.231081 0.273392 0.246718 0.253517 0.379646 0.298767 0.335427 0.292139
chargesum: 0.00000
title: Mulliken charges with hydrogens summed into heavy atoms:
elementType: O O O O N N N N C C C C C C C C C C C C C C C C
charge: -0.188927 -0.271836 -0.212889 -0.207383 0.009180 -0.058720 0.023315 0.015572 0.153282 -0.017201 -0.015182 0.391452 -0.001132 -0.087103 0.066881 -0.173040 -0.146191 -0.046993 0.297323 0.255535 0.006959 -0.163299 -0.075840 0.446236
polarizability: 4.37360890e+02 -2.03855902e+01 2.37146273e+02 7.76301180e+00 -1.94017875e+00 1.34191442e+02
1716.lowfreq: -7.8656 -4.9311 -1.7636 -0.0006 -0.0006 -0.0004 18.0827 28.0872 39.2928
frequency: 17.9124 27.9430 39.2793 54.0633 64.9795 74.0223 77.6145 135.7202 141.3787 156.3517 161.4641 168.8460 174.1572 187.0587 199.2937 208.5396 238.6718 260.4284 270.7428 289.5926 302.0042 311.0740 346.5997 358.3843 369.1662 394.2404 414.0079 428.0658 432.6329 455.8555 466.3651 506.2740 515.7724 543.4287 567.7677 591.3981 610.5651 628.8460 634.8199 652.2847 664.0859 702.5133 706.0019 725.7334 753.2997 801.0509 810.2675 819.1222 838.9481 858.2144 863.1251 867.0765 879.1224 890.1692 936.9098 963.6135 971.9088 974.4787 998.3024 1011.2643 1020.3607 1036.8310 1043.3220 1050.5679 1057.6988 1098.6258 1099.9348 1103.0015 1113.0617 1131.3969 1136.1407 1162.6196 1168.0223 1174.9642 1211.3826 1231.6529 1234.6049 1248.9953 1269.2429 1301.9657 1318.2098 1333.0158 1338.6381 1340.4316 1350.0400 1359.2638 1381.4522 1386.0230 1388.1362 1400.0193 1447.1551 1453.7458 1456.3657 1459.1385 1461.2749 1465.1089 1470.9640 1474.1644 1477.6933 1482.1346 1488.1152 1517.7408 1562.9927 1582.6289 1623.4047 1678.3537 2949.4575 2967.6663 2968.6773 2979.0846 2991.6610 2997.8294 3010.6111 3038.4606 3039.6412 3041.4892 3053.8992 3078.7260 3090.7520 3095.9928 3098.4068 3105.9667 3180.1624 3189.2673 3201.2047 3240.9794
redmass: 4.2343 4.7497 5.0849 8.3561 7.6520 3.2375 10.1740 5.0317 4.4844 1.8965 3.3311 4.8219 2.3445 1.4664 1.8891 1.2235 2.4707 2.5044 2.5076 2.0408 5.6346 8.3369 3.0822 3.5651 4.3177 5.5521 5.0491 3.7590 3.2787 4.8230 3.8891 8.1590 3.5697 3.8808 3.1996 3.1814 4.9078 3.0494 4.6840 7.9120 6.8843 4.4331 7.7838 4.9563 12.7724 2.0617 1.3972 1.1817 3.3488 2.5077 1.4178 1.8005 1.7876 6.5895 2.2069 1.4054 1.6475 2.0309 2.0741 1.3140 1.5773 2.2226 1.8248 1.6738 2.0397 2.4184 2.1952 2.0130 2.2041 1.9074 1.3504 3.8800 5.4416 1.6753 4.5347 1.9414 1.7554 2.7831 1.5116 2.1465 1.6360 1.3555 2.5958 1.9529 1.5050 6.7339 1.8024 1.6069 1.4635 1.2181 3.8454 1.3039 1.1109 1.0811 1.0596 1.0686 1.1047 1.0838 1.3798 1.0741 1.5247 3.1751 7.9027 4.9127 7.3178 6.9876 1.0655 1.0375 1.0394 1.0601 1.0643 1.0369 1.0889 1.0977 1.0979 1.0972 1.1034 1.0984 1.0903 1.0993 1.1001 1.0966 1.0895 1.0919 1.0961 1.0786
irintensity: 0.0441 1.2770 0.3228 0.0267 0.7309 0.1342 0.5605 4.1223 1.2017 1.6159 3.7564 0.2478 0.3768 2.8381 3.4626 2.7909 2.1121 0.2801 1.3769 1.1108 0.3648 0.4362 0.5185 0.5553 2.4471 0.3239 5.6543 9.3593 0.8239 1.7017 0.6044 6.6792 12.1004 4.2214 0.9375 5.2638 1.0951 3.2685 14.2864 15.2664 12.5474 0.0498 7.7019 1.8270 10.7896 8.2505 7.9153 86.2472 5.1919 2.1916 19.5289 7.6105 4.3162 5.9563 11.6978 24.0036 4.4176 15.7459 17.6898 0.0016 2.4220 36.1843 10.5553 21.5382 29.0177 37.4894 25.8982 9.9393 9.9082 23.6680 43.6471 107.7215 267.4816 30.0848 456.7856 160.9539 4.7906 14.4931 3.4534 96.8669 3.0863 28.5842 145.6939 75.4299 1.2757 82.4436 21.0236 2.7268 67.1086 19.3693 2.8161 20.1114 2.5388 5.2069 15.1354 22.1004 15.5793 10.3198 11.9377 23.8268 81.5477 89.9500 26.1399 166.5841 465.5686 0.5295 46.3904 30.7509 7.6733 23.9805 19.1741 15.1491 58.0397 26.3483 37.8144 1.9625 52.5686 24.4092 48.4181 28.5016 37.9440 12.5784 3.4283 20.5106 0.0029 65.0468
temp: 298.150 k
press: 1.00000 atm
elementType: 8 8 8 8 7 7 7 7 6 6 6 6 6 6 6 6 6 6 6 6 6 6 6 6 1 1 1 1 1 1 1 1 1 1 1 1 1 1 1 1 1 1 1 1
symmnumber: 1
zpe: 905712.8 jmol-1
zpe.correction: 0.344968 hartree
zpe.thermalcorrener: 0.368089 hartree
zpe.thermalcorrenthalpy: 0.369033 hartree
zpe.thermalcorrgfe: 0.291386 hartree
zpe.sumelectzpe: -1139.632202 hartree
zpe.sumelectthermal: -1139.609081 hartree
zpe.sumelectthermalent: -1139.608137 hartree
zpe.sumelectthermalfe: -1139.685784 hartree
dipole: -9.8378 -0.7494 -0.1463
dipole: 9.8674
quadrupole: -173.6683 -157.2066 -137.8350
quadrupole: 1.1170 1.7368 1.0898
quadrupole: -17.4317 -0.9699 18.4016 1.1170 1.7368 1.0898
hfenergy: -1139.97717 hartree
pointgroup: C01 [X(C16H20N4O4)]
dipole: -3.8689576 -0.3197266 -0.0001452 debye
polarizability: 437.7952165|-19.2174882|236.8421874|1.4057532|2.7922234|134.0612014 unknown
InChI: InChI=1S/C16H20N4O4/c1-11-6-4-5-9-16(11,3)12(2)17-18-14-8-7-13(19(21)22)10-15(14)20(23)24/h6-8,10,18H,4-5,9H2,1-3H3
charge 0 multiplicity 1
44 atoms
O  3.552957 3.225441 -0.119801
O  1.283435 3.033764 -0.079659
O  5.576549 -2.716515 -0.17141
O  6.449231 -0.603952 -0.186688
N  -0.917136 -0.196962 -0.048912
N  0.172078 0.679604 -0.058216
N  2.489187 2.501433 -0.102106
N  5.453096 -1.427513 -0.167239
C  -3.330545 -0.591122 -0.076029
C  -4.002043 -0.348204 -1.47677
C  -5.440699 -0.90241 -1.544527
C  -4.318194 -0.243018 1.065604
C  -6.337294 -0.189385 -0.509465
C  -2.897258 -2.079833 0.043767
C  -2.117126 0.353311 -0.009289
C  -5.650197 -0.064429 0.837661
C  -3.74635 -0.154254 2.471028
C  -2.356152 1.853463 0.042348
C  1.450695 0.177706 -0.083617
C  2.608299 1.045566 -0.105952
C  1.683402 -1.238877 -0.089453
C  3.917229 0.515497 -0.133019
C  2.973176 -1.758732 -0.116536
C  4.088779 -0.872582 -0.138424
H  -3.363991 -0.810241 -2.253509
H  -4.040691 0.738208 -1.691616
H  -5.436556 -1.990492 -1.344628
H  -5.846597 -0.765576 -2.564579
H  -7.292342 -0.737258 -0.385679
H  -6.618395 0.820385 -0.879581
H  -3.783342 -2.734564 -0.01466
H  -2.198784 -2.347557 -0.76727
H  -2.382157 -2.277366 0.99883
H  -6.295792 0.173175 1.696408
H  -3.258338 -1.101635 2.770096
H  -4.537525 0.063617 3.2090
H  -2.976317 0.636986 2.558344
H  -3.426706 2.071638 0.174597
H  -1.81051 2.324679 0.88352
H  -2.013113 2.352373 -0.885908
H  0.099275 1.716717 -0.060981
H  0.806314 -1.887908 -0.071839
H  4.778279 1.188379 -0.149738
H  3.154369 -2.836653 -0.121408
