program: Gaussian 09
title: 000228108
version: EM64L-G09RevD.01
frameworkgroup: C1[X(C12H21NO6)]
method: RPBEPBE
basis: SDD
operation: Freq
keyword: #p
keyword: freq=noraman
keyword: PBEPBE/SDD
title: #p freq=noraman PBEPBE/SDD
converged: YES YES NO NO
title: Mulliken charges:
elementType: O O O O O O N C C C C C C C C C C C C H H H H H H H H H H H H H H H H H H H H H
charge: -0.296652 -0.292073 -0.308629 -0.320033 -0.436930 -0.263893 -0.603104 -0.171196 -0.067852 -0.130849 -0.157815 0.361655 0.355951 -0.325911 -0.680670 -0.699068 -0.708215 -0.687105 0.177356 0.273377 0.229161 0.261125 0.284306 0.194535 0.219720 0.217301 0.229530 0.224838 0.216235 0.209390 0.271841 0.220390 0.223518 0.247523 0.223194 0.233000 0.233019 0.353689 0.333054 0.356291
chargesum: 0.00000
title: Mulliken charges with hydrogens summed into heavy atoms:
elementType: O O O O O O N C C C C C C C C C C C C
charge: -0.296652 -0.292073 -0.308629 -0.320033 -0.083241 -0.263893 0.086241 0.102180 0.161310 0.130276 0.126491 0.361655 0.355951 0.088344 -0.009002 -0.001602 -0.016785 0.002108 0.177356
polarizability: 1.73667714e+02 -1.83598543e+00 1.56681916e+02 -4.71673798e+00 -2.85021826e+00 1.29752536e+02
1716.lowfreq: -7.6689 -0.0010 -0.0006 -0.0003 5.8296 11.5133 28.9002 38.7021 42.4474
frequency: 28.7051 38.6281 42.4125 57.0319 63.4928 76.6084 84.9013 114.9489 144.6591 160.0513 173.8738 179.6407 184.3917 221.2711 234.0964 247.2945 275.5801 297.7259 312.6975 322.5500 325.8518 349.7078 375.0001 398.7713 438.1106 455.9099 473.0733 491.8523 498.1965 531.0600 583.5169 590.7539 599.5758 627.1267 651.2911 673.7420 693.6402 712.7485 724.0349 741.3428 765.9572 810.3692 853.5667 884.1649 893.9791 918.7948 920.6622 942.3078 958.0906 969.2113 981.7331 984.3282 992.2754 995.2447 1022.2351 1040.0383 1061.4915 1067.0799 1091.8213 1107.8891 1139.8942 1143.4785 1178.7910 1197.4451 1212.7217 1222.3709 1238.1964 1249.6592 1261.6484 1280.8156 1290.2912 1303.2156 1309.2910 1333.8048 1353.7162 1361.1593 1364.4792 1374.7201 1382.0447 1384.4351 1388.9456 1393.4079 1449.5112 1451.3819 1453.3582 1455.4893 1461.7282 1468.0745 1471.5449 1474.5600 1478.5378 1561.4644 1637.3145 2947.6071 2966.5889 2996.2669 2996.5751 3000.9620 3007.7697 3009.9135 3033.1358 3047.4348 3068.1575 3094.4130 3097.6597 3099.7429 3104.3719 3108.1389 3109.2191 3121.4367 3123.6347 3497.0933 3514.4105 3661.9355
redmass: 4.5459 6.4256 5.1400 4.5638 4.0145 4.3196 3.9991 3.7195 3.9345 2.5104 1.2751 2.9273 1.0859 1.3122 1.1115 2.0973 4.4660 3.5754 3.4024 2.5591 2.9955 3.5199 2.5960 3.4981 3.7800 3.3733 3.4512 1.6664 1.7319 3.4089 1.8160 3.8264 3.2468 3.5798 1.5893 1.7273 5.5209 4.9161 6.2223 5.3506 3.4438 4.8777 3.2631 4.2358 5.1544 1.5222 1.5598 2.2166 2.3471 3.5559 1.3232 1.5557 3.4954 3.9458 2.5237 4.4741 2.9645 2.0293 3.0773 2.7321 1.8916 1.9621 1.2164 2.5633 2.6255 1.3383 3.4493 1.2664 2.9269 1.2720 1.2087 1.3041 1.2473 1.2113 1.5733 2.1148 1.8479 1.2758 1.3094 1.2980 1.2283 1.2342 1.0510 1.0509 1.0492 1.0497 1.0826 1.0616 1.0646 1.0475 1.0503 1.3476 5.5128 1.0682 1.0828 1.0355 1.0351 1.0354 1.0358 1.0856 1.0844 1.0861 1.0957 1.0999 1.1000 1.1002 1.0995 1.1007 1.0995 1.1006 1.1004 1.0446 1.0650 1.1043
irintensity: 1.4306 2.0649 0.2366 4.7736 4.0076 6.3316 0.1206 4.0114 11.6245 1.6047 0.2101 1.9582 0.1256 0.4510 1.5862 2.9751 0.8902 4.9858 15.7017 0.7536 2.6604 0.4343 12.2401 1.5637 4.4273 0.4610 7.3832 35.9866 131.0926 6.1777 106.0582 14.8035 20.5589 52.5677 90.8842 6.4899 11.3774 15.0524 2.9933 57.0723 48.0157 69.4299 38.9433 6.9233 0.7018 2.4073 1.1700 3.3767 5.2209 88.5568 4.9966 21.4119 111.5196 126.5019 36.5968 17.7829 32.9661 4.4261 11.2152 21.5564 70.2548 35.6991 23.3427 138.4497 108.5339 18.3204 45.3887 7.5444 53.8557 3.4988 0.1015 12.5537 0.1182 9.4401 6.3084 87.5122 24.3300 39.2066 41.2816 36.2653 37.4365 31.7421 1.4737 1.7368 1.6322 4.8339 4.7822 1.6760 3.4664 27.6329 5.4048 111.9485 302.5480 52.5808 21.6914 11.8547 8.5497 22.9241 9.6317 12.6342 8.2313 8.7155 43.3817 2.7713 16.1313 13.5597 31.6455 24.4086 26.6467 25.6132 4.1926 42.1259 8.9280 59.5381
temp: 298.150 k
press: 1.00000 atm
elementType: 8 8 8 8 8 8 7 6 6 6 6 6 6 6 6 6 6 6 6 1 1 1 1 1 1 1 1 1 1 1 1 1 1 1 1 1 1 1 1 1
symmnumber: 1
zpe: 860061.6 jmol-1
zpe.correction: 0.327580 hartree
zpe.thermalcorrener: 0.348521 hartree
zpe.thermalcorrenthalpy: 0.349465 hartree
zpe.thermalcorrgfe: 0.277434 hartree
zpe.sumelectzpe: -974.445106 hartree
zpe.sumelectthermal: -974.424165 hartree
zpe.sumelectthermalent: -974.423221 hartree
zpe.sumelectthermalfe: -974.495252 hartree
dipole: -4.3634 2.6952 -0.3956
dipole: 5.1440
quadrupole: -102.3114 -119.6245 -118.0406
quadrupole: 4.7003 -12.9232 -0.2550
quadrupole: 11.0141 -6.2990 -4.7151 4.7003 -12.9232 -0.2550
hfenergy: -974.7726863 hartree
pointgroup: C01 [X(C12H21N1O6)]
dipole: -1.6081905 0.7698674 -0.9574827 debye
polarizability: 173.8705073|-1.4443815|146.0108214|2.415761|-13.8755532|140.2208373 unknown
InChI: InChI=1S/C12H21NO6/c1-11(2)16-6(5-14)7(17-11)8-9(10(13)15)19-12(3,4)18-8/h6-9,14H,5,13H2,1-4H3
charge 0 multiplicity 1
40 atoms
O  1.485988 -0.839237 -0.865596
O  -0.602714 1.209231 0.039671
O  2.723433 0.775704 0.358461
O  -2.301206 0.181154 -1.222863
O  3.783892 0.015748 2.850414
O  -1.772132 -2.930235 0.674821
N  -3.656056 -1.97605 -0.33984
C  0.862979 -0.760506 0.466712
C  -0.570882 -0.212985 0.426379
C  1.845499 0.072796 1.328607
C  -1.47259 -0.901193 -0.642463
C  2.564295 0.180305 -0.996731
C  -1.946749 1.461313 -0.517917
C  2.727565 -0.79249 2.245593
C  3.847727 -0.550039 -1.408525
C  2.14117 1.292377 -1.959648
C  -1.840387 2.570418 -1.556676
C  -2.969346 1.73233 0.598491
C  -2.318048 -2.031454 -0.035987
H  0.781444 -1.802119 0.834604
H  -1.005358 -0.342461 1.44073
H  1.341117 0.864237 1.909432
H  -0.839906 -1.313717 -1.449498
H  3.150608 -1.640104 1.662847
H  2.137247 -1.196937 3.086383
H  4.684645 0.165449 -1.484799
H  4.10136 -1.323924 -0.665111
H  3.706419 -1.036575 -2.389043
H  2.934278 2.05776 -2.020449
H  1.969818 0.87612 -2.967829
H  1.215828 1.759006 -1.588715
H  -2.821134 2.73971 -2.032243
H  -1.510274 3.508847 -1.079347
H  -1.113437 2.283557 -2.332698
H  -3.975322 1.867605 0.165023
H  -3.010572 0.893776 1.314817
H  -2.693962 2.650308 1.145648
H  4.17934 0.556977 2.116014
H  -4.283531 -2.703774 -0.000384
H  -3.998346 -1.194326 -0.901684
