program: Gaussian 09
title: 000228103
version: EM64L-G09RevD.01
frameworkgroup: C1[X(C12H13NO2)]
method: RPBEPBE
basis: SDD
operation: Freq
keyword: #p
keyword: freq=noraman
keyword: PBEPBE/SDD
title: #p freq=noraman PBEPBE/SDD
converged: YES YES NO NO
title: Mulliken charges:
elementType: O O N C C C C C C C C C C C C H H H H H H H H H H H H H
charge: -0.251873 -0.213244 -0.010837 -0.613932 -0.207718 0.492570 0.235201 -0.413292 -0.378103 -0.226063 -0.229997 -0.236946 -0.143272 -0.263838 -0.658952 0.255605 0.234994 0.299339 0.230001 0.240549 0.226064 0.229586 0.230224 0.228985 0.236229 0.221148 0.249765 0.237805
chargesum: 0.00000
title: Mulliken charges with hydrogens summed into heavy atoms:
elementType: O O N C C C C C C C C C C C C
charge: -0.251873 -0.213244 -0.010837 -0.123334 0.091621 0.492570 0.235201 -0.183291 -0.137554 0.000002 -0.000411 -0.006722 -0.143272 0.201376 0.049767
polarizability: 1.73937726e+02 6.80820572e+00 1.29428200e+02 -1.01658857e+01 8.28909757e+00 9.70036654e+01
1716.lowfreq: -9.6627 -2.4804 -0.0005 0.0006 0.0008 5.0694 11.0314 27.7504 41.0308
frequency: -6.0747 27.7091 40.7634 49.7898 70.4682 83.8063 136.8143 159.4486 192.5911 219.3571 240.2997 297.8630 329.3381 352.6529 402.7260 423.5473 443.2203 483.2579 551.2286 571.0150 618.0779 637.9987 705.1593 719.4113 756.4822 777.8529 813.4741 821.3931 833.7462 854.0147 909.5562 930.2988 976.8950 982.6721 990.6615 997.0910 1012.6656 1027.3819 1047.7962 1084.9897 1095.8374 1121.9104 1157.7268 1172.8519 1177.9353 1190.0559 1219.7597 1249.2734 1278.1793 1292.5835 1323.4856 1330.9732 1354.8626 1383.6623 1395.3078 1442.0048 1457.5544 1463.9312 1468.0848 1483.7042 1485.6739 1594.3639 1615.9008 1644.8994 2194.9462 2996.3743 3015.3909 3021.0870 3033.2641 3084.2494 3091.7444 3098.5894 3112.2303 3124.7204 3125.4079 3135.6603 3147.9604 3165.0857
redmass: 4.2788 5.3824 3.6131 4.2718 4.5887 4.4721 4.6552 3.7861 4.0553 1.5112 5.4124 2.7962 2.3593 4.3408 2.8149 5.7923 4.8060 3.9689 5.4764 3.5211 6.2273 5.5917 1.8340 4.1469 1.9535 3.4687 1.5085 2.5815 3.3766 1.2492 2.0112 1.8867 1.4005 2.2783 5.7920 1.3278 2.8069 2.2312 4.2026 1.6672 2.1829 2.3699 1.6724 1.1025 1.2778 1.1269 2.3198 1.5150 1.1227 1.3683 1.4654 1.2579 1.2752 7.7548 1.2261 2.1757 1.0930 1.0430 1.1020 1.0523 2.3041 6.0369 6.1614 9.6024 12.5362 1.0363 1.0772 1.0658 1.0602 1.1026 1.0977 1.1024 1.0880 1.1064 1.0862 1.0912 1.0960 1.1015
irintensity: 1.0207 1.4679 0.5849 1.4192 0.2950 1.8950 2.7139 0.2322 1.4928 4.4149 0.7867 19.1435 0.3394 3.5283 0.0220 0.4629 3.3415 6.5314 9.1264 20.6524 0.1217 4.5901 51.9751 9.7278 43.6592 10.7228 6.0347 1.7372 6.5393 0.0299 4.9634 1.0342 0.1372 1.9744 1.0247 0.1361 51.0520 3.3005 26.2693 43.0567 39.6093 197.2353 18.2685 11.5246 51.0323 0.2739 1.4655 121.1985 7.7244 1.5054 7.3797 0.3037 1.6628 0.0122 23.8023 8.2134 14.2355 15.8655 11.0630 15.4971 13.9521 1.3664 4.7295 182.4418 6.4404 14.3552 4.2210 9.8267 28.2481 6.3347 29.6999 2.5235 10.3936 27.1757 2.2460 13.2825 36.5517 19.9649
temp: 298.150 k
press: 1.00000 atm
elementType: 8 8 7 6 6 6 6 6 6 6 6 6 6 6 6 1 1 1 1 1 1 1 1 1 1 1 1 1
symmnumber: 1
zpe: 582107.3 jmol-1
zpe.correction: 0.221713 hartree
zpe.thermalcorrener: 0.235813 hartree
zpe.thermalcorrenthalpy: 0.236757 hartree
zpe.thermalcorrgfe: 0.178743 hartree
zpe.sumelectzpe: -669.164670 hartree
zpe.sumelectthermal: -669.150570 hartree
zpe.sumelectthermalent: -669.149625 hartree
zpe.sumelectthermalfe: -669.207639 hartree
dipole: -0.9807 -3.0597 -1.0190
dipole: 3.3708
quadrupole: -67.2751 -93.6228 -92.5822
quadrupole: 2.8930 2.3490 7.2948
quadrupole: 17.2183 -9.1294 -8.0889 2.8930 2.3490 7.2948
hfenergy: -669.3863825 hartree
pointgroup: C01 [X(C12H13N1O2)]
dipole: 0.3139439 1.1269413 0.6246062 debye
polarizability: 174.6722056|2.0169624|119.3789339|8.2083667|17.9485552|106.3184512 unknown
InChI: InChI=1S/C12H13NO2/c1-2-15-12(14)11(9-13)8-10-6-4-3-5-7-10/h3-7,11H,2,8H2,1H3
charge 0 multiplicity 1
28 atoms
O  2.824162 1.511176 -0.349624
O  2.51826 0.047644 1.44684
N  0.591174 -0.95238 -2.281388
C  -0.341341 0.030948 1.011399
C  0.632204 0.570076 -0.088379
C  -1.801082 0.138414 0.597512
C  2.083037 0.650539 0.443528
C  -2.538993 1.318335 0.874261
C  -2.445053 -0.92147 -0.090719
C  -3.887768 1.439461 0.471465
C  -3.793713 -0.804055 -0.495079
C  -4.519234 0.377064 -0.216066
C  0.612092 -0.262316 -1.308567
C  4.284154 1.649065 -0.021275
C  5.089721 0.531957 -0.687259
H  -0.061519 -1.010936 1.242564
H  -0.151167 0.622927 1.924867
H  0.331463 1.593923 -0.383534
H  -2.058248 2.142149 1.417734
H  -1.888516 -1.839733 -0.313236
H  -4.445749 2.355148 0.697384
H  -4.276443 -1.631807 -1.026243
H  -5.565791 0.467558 -0.527648
H  4.538663 2.643461 -0.419685
H  4.395318 1.634749 1.077179
H  6.168438 0.700942 -0.512939
H  4.82496 -0.452638 -0.26698
H  4.913968 0.514901 -1.776213
