program: Gaussian 09
title: 000228100
version: EM64L-G09RevD.01
frameworkgroup: C1[X(C11H22O6)]
method: RPBEPBE
basis: SDD
operation: Freq
keyword: #pfreq=noraman
keyword: PBEPBE/SDD
title: #p freq=noraman PBEPBE/SDD
converged: YES YES NO NO
title: Mulliken charges:
elementType: O O O O O O C C C C C C C C C C C H H H H H H H H H H H H H H H H H H H H H H
charge: -0.267045 -0.305101 -0.292768 -0.309342 -0.280450 -0.291207 -0.147226 -0.047436 -0.007127 -0.077651 -0.000356 -0.351709 -0.507327 -0.516414 -0.516924 -0.504375 -0.490015 0.228586 0.245823 0.238749 0.246310 0.210615 0.207425 0.233337 0.194530 0.256891 0.219593 0.234349 0.200402 0.216868 0.199297 0.253333 0.218177 0.226653 0.244075 0.201246 0.203629 0.229834 0.202749
chargesum: 0.00000
title: Mulliken charges with hydrogens summed into heavy atoms:
elementType: O O O O O O C C C C C C C C C C C
charge: -0.267045 -0.305101 -0.292768 -0.309342 -0.280450 -0.291207 0.081360 0.198387 0.231622 0.168659 0.210259 0.089053 0.163687 0.135204 0.153883 0.167600 0.146197
polarizability: 1.63809438e+02 -2.91152230e+00 1.37030278e+02 -6.53679320e-01 3.38881962e-01 1.22400720e+02
1716.lowfreq: -13.3047 -0.0009 -0.0005 -0.0003 4.2321 10.5209 39.2759 50.6514 58.3979
frequency: 39.2183 50.6035 58.3739 68.1772 75.6745 84.5560 94.4493 101.6166 109.3532 128.8939 148.9599 159.8490 165.8911 175.1207 176.1026 186.8906 222.3629 235.0170 250.7619 264.4535 269.2291 293.7693 322.4991 350.5039 362.9528 401.4873 449.2261 469.1236 505.6802 562.2957 597.8892 631.1118 731.1893 813.1746 848.2179 874.6564 903.0712 914.7510 929.5287 943.1922 962.6162 998.7342 1031.4837 1041.8531 1047.0018 1062.6951 1070.8248 1087.3186 1096.8774 1111.4360 1114.8018 1116.3516 1116.6860 1118.7841 1128.6680 1134.6575 1151.8784 1153.5559 1159.3439 1164.4736 1172.8652 1200.9676 1242.9299 1257.4432 1278.7452 1293.8482 1308.7265 1329.8955 1337.4868 1348.3569 1354.5687 1372.5585 1384.0304 1424.7825 1429.2366 1434.6045 1436.7173 1438.5975 1447.9589 1449.2679 1453.9747 1457.0522 1460.7371 1466.0071 1475.3395 1479.9385 1482.5467 1483.0384 1486.9408 2924.4876 2927.5190 2933.8298 2947.5106 2950.2037 2955.9513 2957.2872 2964.4319 2979.8404 2984.3581 2997.6734 3010.4228 3013.9768 3026.6045 3056.6035 3058.0774 3064.3319 3098.5770 3099.5086 3107.6369 3107.9231 3119.3825
redmass: 3.5055 2.8386 3.5381 2.3692 2.9461 2.3909 1.6604 2.3237 2.3540 1.7958 1.2815 2.6816 1.3855 2.0113 2.5507 2.3559 1.5228 3.1642 3.1763 3.7036 4.7857 3.3157 3.8655 3.7619 4.8619 5.5300 4.3704 3.4837 4.9105 5.5376 3.1031 4.7522 4.2550 3.6852 4.0691 6.6645 2.6872 6.1925 5.0711 6.4778 3.5517 3.9842 3.5540 4.1984 2.6734 5.4252 5.2787 3.0897 2.2231 1.2873 1.2794 1.2779 1.2513 1.3904 2.8265 1.8180 1.4138 1.4297 1.4766 1.6300 1.6178 1.3460 1.5516 1.3083 1.2570 1.1981 1.3382 1.2577 1.2816 1.4544 1.3621 1.3855 1.4905 1.1484 1.1521 1.1562 1.1403 1.1509 1.0553 1.0579 1.0531 1.0516 1.0537 1.0657 1.0534 1.0528 1.0668 1.0528 1.0523 1.0344 1.0829 1.0337 1.0381 1.0376 1.0569 1.0376 1.0836 1.0834 1.0839 1.1025 1.0888 1.0988 1.1042 1.0924 1.0931 1.0954 1.0983 1.0975 1.1046 1.1041 1.1031
irintensity: 0.1531 1.2361 0.7403 5.6932 3.2348 2.1510 4.2309 10.9649 3.3783 1.8416 2.0597 0.1691 1.9825 2.9557 9.5534 2.1058 5.0888 2.0374 10.0090 12.6957 8.2487 1.5011 3.8966 3.7269 3.5433 1.3297 10.1503 15.7436 15.8608 2.8151 3.4229 12.2970 12.0746 0.9326 1.4461 66.7966 3.2753 24.5693 19.2138 95.4405 72.9872 86.5382 58.0133 93.7387 25.9825 128.0972 202.5865 27.1051 32.3504 0.4832 3.8282 5.8187 0.7801 4.0644 75.3738 7.0396 16.5731 18.1027 5.0711 9.0320 1.7483 1.0863 1.2096 5.1945 3.2492 3.4530 4.7556 13.3659 27.3006 3.1348 3.6253 4.6544 5.8799 2.1390 10.5231 4.4065 2.1807 1.6677 10.2717 0.8886 9.9030 10.2927 6.8381 15.3016 10.4091 12.2396 10.4650 11.0484 15.0310 95.7922 34.0261 66.3202 86.3686 85.1721 47.4554 78.9229 38.5863 4.7238 35.6470 84.7596 50.5220 38.0057 38.1819 28.1289 55.5664 42.5300 25.4465 35.0405 23.1689 24.4736 26.3075
temp: 298.150 k
press: 1.00000 atm
elementType: 8 8 8 8 8 8 6 6 6 6 6 6 6 6 6 6 6 1 1 1 1 1 1 1 1 1 1 1 1 1 1 1 1 1 1 1 1 1 1
symmnumber: 1
zpe: 857215.4 jmol-1
zpe.correction: 0.326496 hartree
zpe.thermalcorrener: 0.347495 hartree
zpe.thermalcorrenthalpy: 0.348439 hartree
zpe.thermalcorrgfe: 0.276375 hartree
zpe.sumelectzpe: -882.192001 hartree
zpe.sumelectthermal: -882.171002 hartree
zpe.sumelectthermalent: -882.170058 hartree
zpe.sumelectthermalfe: -882.242123 hartree
dipole: 0.6075 -0.6261 -0.2619
dipole: 0.9109
quadrupole: -89.8435 -91.3346 -103.1118
quadrupole: -0.0691 -3.1720 5.7121
quadrupole: 4.9198 3.4287 -8.3485 -0.0691 -3.1720 5.7121
hfenergy: -882.5184973 hartree
pointgroup: C01 [X(C11H22O6)]
dipole: -0.2381732 0.2326744 -0.1325243 debye
polarizability: 163.1130141|-1.2022441|136.7765722|6.2736975|-0.1949147|123.3508498 unknown
InChI: InChI=1S/C11H22O6/c1-12-6-7-8(13-2)9(14-3)10(15-4)11(16-5)17-7/h7-11H,6H2,1-5H3
charge 0 multiplicity 1
39 atoms
O  -0.133972 -1.360486 -0.149444
O  0.163367 1.559306 1.734192
O  -1.209208 0.978207 -1.657159
O  2.664705 1.164105 0.205806
O  2.184874 -1.732548 -0.117495
O  -3.670357 -0.417691 0.171278
C  0.258996 1.489968 0.268351
C  -1.112827 0.932769 -0.190863
C  1.397921 0.561618 -0.214474
C  -1.272218 -0.524943 0.284961
C  1.165875 -0.85105 0.359595
C  -2.517015 -1.201744 -0.289505
C  1.064331 2.532834 2.367437
C  -1.781549 2.231349 -2.150519
C  3.814469 0.789785 -0.63149
C  2.106087 -3.083413 0.462082
C  -4.92865 -0.945616 -0.346281
H  0.430289 2.505091 -0.149717
H  -1.918912 1.534891 0.273833
H  1.337326 0.486723 -1.321956
H  -1.324794 -0.501559 1.393572
H  1.12803 -0.829556 1.474197
H  -2.581914 -2.246166 0.082388
H  -2.459764 -1.203516 -1.396265
H  0.907607 3.546676 1.942553
H  2.120141 2.242016 2.233086
H  0.789372 2.536918 3.434793
H  -1.83141 2.131852 -3.246751
H  -1.150069 3.108739 -1.896054
H  -2.801431 2.391128 -1.744201
H  3.631171 1.062825 -1.691827
H  4.019376 -0.292436 -0.564185
H  4.665841 1.37264 -0.243955
H  2.989876 -3.621903 0.087135
H  1.181632 -3.591318 0.13697
H  2.13583 -3.037939 1.570452
H  -4.947473 -0.933949 -1.457193
H  -5.72511 -0.290904 0.04188
H  -5.107144 -1.986302 0.000474
