program: Gaussian 09
title: 000228094
version: EM64L-G09RevD.01
frameworkgroup: C1[X(C10H18O8)]
method: RPBEPBE
basis: SDD
operation: Freq
keyword: #pfreq=noraman
keyword: PBEPBE/SDD
title: #p freq=noraman PBEPBE/SDD
converged: YES YES NO NO
title: Mulliken charges:
elementType: O O O O O O O O C C C C C C C C C C H H H H H H H H H H H H H H H H H H
charge: -0.482214 -0.437343 -0.419420 -0.481507 -0.240498 -0.247559 -0.288360 -0.267551 -0.200828 -0.103798 -0.213144 -0.220810 0.287336 0.228120 -0.264912 -0.255909 -0.660574 -0.660786 0.254498 0.282603 0.289633 0.287841 0.383830 0.350953 0.354016 0.378476 0.229677 0.236039 0.239924 0.231703 0.219996 0.236512 0.248967 0.222812 0.249661 0.232617
chargesum: 0.00000
title: Mulliken charges with hydrogens summed into heavy atoms:
elementType: O O O O O O O O C C C C C C C C C C
charge: -0.098384 -0.086389 -0.065405 -0.103031 -0.240498 -0.247559 -0.288360 -0.267551 0.053670 0.178805 0.076489 0.067031 0.287336 0.228120 0.200804 0.215719 0.044900 0.044304
polarizability: 1.79849126e+02 -6.24216897e+00 1.23785936e+02 2.23964472e+00 -7.32131287e-01 1.11602052e+02
1716.lowfreq: -9.6085 -4.7578 -0.0011 -0.0011 -0.0009 3.5633 21.3803 28.4864 33.5567
frequency: 20.8497 28.0124 33.4049 47.6107 60.5476 77.5460 81.1005 94.4671 97.5652 123.8100 127.9748 178.5041 185.6150 199.0421 223.0909 248.2637 254.6649 275.7251 282.0681 300.1558 328.3955 333.7493 361.9234 419.8572 436.3761 452.0261 461.5765 493.6862 511.4121 575.7070 597.2796 626.8257 663.5129 687.8609 722.7065 726.0268 761.5653 797.5344 808.2063 816.2906 817.1763 853.4706 876.0563 914.9688 937.4925 966.8519 995.1435 1006.3154 1017.7852 1040.7035 1056.7754 1066.0746 1096.9832 1097.0863 1153.8493 1158.9312 1163.8848 1186.7758 1196.3003 1214.7774 1236.1062 1242.9534 1274.8336 1277.7731 1288.0995 1302.6065 1328.7559 1337.7525 1354.0680 1356.6650 1370.7731 1374.3476 1380.0863 1392.1513 1394.5900 1413.0089 1457.5888 1459.5314 1463.0175 1464.5835 1484.1564 1484.8647 1590.0186 1609.4961 2995.8569 2996.1505 3004.8599 3020.8388 3034.5285 3038.1775 3088.4335 3091.5947 3091.7283 3098.9626 3099.5381 3109.3223 3125.3482 3127.2569 3409.8377 3425.6239 3433.8057 3441.8610
redmass: 4.3416 4.7051 3.6106 3.9278 3.7118 4.6080 6.1584 4.6553 5.6004 5.3671 4.8670 2.2163 3.3994 1.9004 1.7913 3.9447 2.2146 4.9940 3.8109 5.8488 4.0094 4.6319 4.4320 3.3925 1.9493 2.7526 3.2546 2.6048 1.1444 4.0501 1.6008 1.9644 1.5312 3.4411 4.7823 4.1983 3.4544 2.4721 1.4024 2.8011 1.7954 4.1700 4.5033 3.6323 3.3809 4.2420 3.0962 2.8039 3.3178 4.1437 4.2773 2.3400 2.1837 2.1759 1.8681 1.6593 2.0574 1.1690 2.8670 1.3013 1.2912 1.3025 1.1241 1.1271 1.3810 1.3480 1.4313 1.2982 1.2908 1.3866 1.4528 1.3097 1.2303 1.2282 1.2333 1.5670 1.1043 1.1008 1.0456 1.0465 1.0535 1.0524 6.9963 8.6022 1.0362 1.0362 1.0847 1.0829 1.0598 1.0602 1.0862 1.0973 1.0976 1.1026 1.1027 1.0868 1.1067 1.1072 1.0652 1.0645 1.0645 1.0643
irintensity: 2.1294 1.5168 0.8820 0.4550 0.4349 0.1385 2.9211 0.8525 4.5212 0.9433 2.6610 2.5804 1.1700 1.1552 7.2518 9.1239 1.5762 23.9056 0.6130 17.5858 30.5105 39.7762 12.8789 8.0521 18.4164 35.8815 76.3346 42.6495 69.4870 8.6568 96.3220 48.1426 377.5518 19.0364 17.2353 18.1195 14.5933 4.4544 0.6781 27.5290 8.9258 22.8423 2.4114 11.6907 48.9028 47.1504 26.4889 113.4826 46.0579 92.7021 32.6917 73.1805 29.7642 10.7884 83.4059 3.7612 220.9539 27.5460 301.5082 56.8015 124.5405 55.7064 7.5456 11.8593 41.5868 14.4136 46.6620 29.5839 12.8222 4.1685 60.9100 26.4182 40.2114 20.8510 23.3880 12.4064 15.7249 16.6915 14.1655 13.9424 13.7015 13.5618 138.2654 156.0185 17.2031 15.4373 18.6630 14.6412 26.9391 21.9190 6.4257 34.0348 26.2017 2.2797 2.5780 3.1931 28.2472 24.2018 64.0219 78.3914 77.2610 16.3812
temp: 298.150 k
press: 1.00000 atm
elementType: 8 8 8 8 8 8 8 8 6 6 6 6 6 6 6 6 6 6 1 1 1 1 1 1 1 1 1 1 1 1 1 1 1 1 1 1
symmnumber: 1
zpe: 749529.2 jmol-1
zpe.correction: 0.285481 hartree
zpe.thermalcorrener: 0.306361 hartree
zpe.thermalcorrenthalpy: 0.307305 hartree
zpe.thermalcorrgfe: 0.233437 hartree
zpe.sumelectzpe: -992.187339 hartree
zpe.sumelectthermal: -992.166459 hartree
zpe.sumelectthermalent: -992.165515 hartree
zpe.sumelectthermalfe: -992.239382 hartree
dipole: -0.2151 -0.4334 0.8209
dipole: 0.9529
quadrupole: -72.2223 -106.0394 -114.4056
quadrupole: -13.8394 0.3467 -2.1185
quadrupole: 25.3335 -8.4836 -16.8498 -13.8394 0.3467 -2.1185
hfenergy: -992.4728197 hartree
pointgroup: C01 [X(C10H18O8)]
dipole: -0.1107472 -0.2454192 0.260888 debye
polarizability: 178.2941161|-11.3043536|124.7430166|1.9430428|2.3602955|112.1999814 unknown
InChI: InChI=1S/C10H18O8/c1-3-17-9(15)7(13)5(11)6(12)8(14)10(16)18-4-2/h5-8,11-14H,3-4H2,1-2H3
charge 0 multiplicity 1
36 atoms
O  -0.544575 -0.611154 1.414251
O  0.893126 1.601721 -1.219818
O  -1.592699 -1.184886 -1.059046
O  1.92625 2.035584 1.248794
O  -3.962194 1.009361 -0.734482
O  3.437624 -0.89697 -0.339511
O  -3.288697 0.037391 1.274242
O  4.292244 1.184578 0.290826
C  -0.550518 0.486224 0.424013
C  0.828448 0.494309 -0.268192
C  -1.683355 0.206391 -0.596149
C  1.956963 0.644047 0.782306
C  -3.042494 0.404416 0.088247
C  3.348801 0.353666 0.217755
C  -5.361012 1.168265 -0.204006
C  4.770895 -1.300632 -0.906453
C  -6.17439 -0.100195 -0.467904
C  5.672776 -1.868835 0.190544
H  -0.710159 1.462917 0.924685
H  0.96364 -0.432916 -0.847566
H  -1.588032 0.847131 -1.484673
H  1.751448 -0.050234 1.618976
H  -1.419313 -0.56015 1.897042
H  1.117853 2.405413 -0.670603
H  -1.301013 -1.709494 -0.258751
H  2.868199 2.368156 1.238216
H  -5.744728 2.036312 -0.762071
H  -5.299462 1.397896 0.874032
H  5.220633 -0.415798 -1.389144
H  4.502666 -2.054546 -1.662431
H  -7.223334 0.062336 -0.158252
H  -6.165391 -0.357107 -1.540682
H  -5.77392 -0.95211 0.106432
H  6.61137 -2.23953 -0.261301
H  5.931724 -1.093226 0.930332
H  5.183522 -2.712031 0.707448
