program: Gaussian 09
title: 000228092
version: EM64L-G09RevD.01
frameworkgroup: C1[X(C10H12N4O4S)]
method: RPBEPBE
basis: SDD
operation: Freq
keyword: #p
keyword: freq=noraman
keyword: PBEPBE/SDD
title: #p freq=noraman PBEPBE/SDD
converged: YES YES NO NO
title: Mulliken charges:
elementType: S O O O O N N N N C C C C C C C C C C H H H H H H H H H H H H
charge: 0.169081 -0.184688 -0.264055 -0.210421 -0.204320 -0.422986 0.010021 0.025838 0.016438 0.310496 0.264893 -0.439817 -0.298500 -0.496922 0.446412 -0.368416 -0.163836 -0.663243 -0.836758 0.286999 0.296425 0.336476 0.293380 0.350644 0.244873 0.247524 0.231151 0.226717 0.258377 0.263715 0.274505
chargesum: 0.00000
title: Mulliken charges with hydrogens summed into heavy atoms:
elementType: S O O O O N N N N C C C C C C C C C C
charge: 0.169081 -0.184688 -0.264055 -0.210421 -0.204320 -0.072343 0.010021 0.025838 0.016438 0.310496 0.264893 -0.152818 -0.002075 -0.160446 0.446412 -0.075036 0.081037 0.042148 -0.040161
polarizability: 3.73244539e+02 9.61405867e+00 2.00781312e+02 -5.79271247e+00 4.07888346e+00 1.07940266e+02
1716.lowfreq: -4.7452 -1.9196 0.0015 0.0016 0.0025 5.7497 22.1362 35.7414 54.5942
frequency: 22.0387 35.6892 54.5805 56.6349 71.1488 74.5934 89.4272 131.7000 145.6535 156.2399 163.5891 190.4691 205.2650 214.7895 245.3062 276.0781 307.0509 312.9147 321.6589 364.9013 376.4232 403.8528 445.8472 473.6933 488.3656 513.2923 516.2595 604.9196 631.0187 652.4371 659.4625 663.8012 675.5269 706.4249 726.2989 754.6200 819.6844 819.9747 863.8171 886.0379 919.0294 932.5303 964.6676 968.4735 977.6494 1010.6928 1018.7003 1035.9340 1054.7560 1097.9740 1101.6198 1137.7522 1166.1119 1168.0186 1207.9590 1215.7147 1230.3633 1283.2516 1297.3707 1320.7645 1344.9869 1347.1582 1364.1328 1393.4038 1400.7245 1446.9768 1447.8584 1460.9806 1469.3708 1474.9645 1476.3507 1517.2111 1567.2278 1586.3623 1623.9785 2988.5394 3004.4756 3014.2462 3061.2220 3086.0033 3101.6414 3120.3991 3135.4926 3180.0473 3188.4526 3200.5390 3219.4420
redmass: 4.9871 5.9926 5.8864 10.4122 6.2711 10.4091 3.3511 1.1313 5.4345 8.6195 5.5816 3.6395 4.9806 1.7002 1.7148 3.6325 5.0706 5.3308 6.3958 7.5841 9.2513 5.5713 4.5636 4.5976 5.9289 6.4139 3.8767 5.2212 5.1085 7.8580 7.0244 5.2486 10.8602 7.6157 5.0284 12.7919 2.0023 1.7785 1.4197 6.9213 1.5255 1.6151 1.4065 1.2070 1.1990 1.3163 3.5206 1.7940 2.0918 2.6083 3.9503 1.3665 4.7396 2.4599 1.6925 2.6025 1.8356 1.3657 1.8983 1.9483 1.8893 1.7895 6.8269 1.3597 2.6178 2.1351 1.5009 1.0538 1.0469 1.3435 1.8183 3.7677 6.3910 5.2141 7.2187 1.0358 1.0289 1.0886 1.0884 1.0986 1.0997 1.1048 1.1034 1.0894 1.0920 1.0962 1.0796
irintensity: 0.3818 1.0915 0.8120 0.3712 0.4727 0.6425 6.0526 0.6527 1.6615 1.5834 5.0833 4.8108 9.6310 2.0123 5.4112 21.0791 1.2389 9.6498 6.3886 1.9697 1.3554 19.0148 1.8308 2.5643 3.2212 4.6671 12.4941 4.6744 4.5415 16.4483 0.9894 2.1496 11.8971 7.3678 1.6312 11.1169 38.3856 47.3926 23.8431 6.4353 40.2179 7.5050 23.8364 13.3334 9.3530 0.0471 49.6482 18.6642 51.4206 32.0921 50.3623 55.8074 292.2917 88.3484 233.9148 207.4105 155.4394 2.3984 101.6703 99.3430 83.1461 90.5826 54.6016 13.6667 17.6516 2.1798 6.5805 15.2816 15.5314 31.8554 33.5739 99.9897 13.3726 124.0770 438.1022 21.3611 17.8837 13.2621 2.7490 21.0293 19.3345 14.1772 7.2569 2.9603 20.4703 0.1275 70.8614
temp: 298.150 k
press: 1.00000 atm
elementType: 16 8 8 8 8 7 7 7 7 6 6 6 6 6 6 6 6 6 6 1 1 1 1 1 1 1 1 1 1 1 1
symmnumber: 1
zpe: 582898.4 jmol-1
zpe.correction: 0.222014 hartree
zpe.thermalcorrener: 0.241158 hartree
zpe.thermalcorrenthalpy: 0.242102 hartree
zpe.thermalcorrgfe: 0.172302 hartree
zpe.sumelectzpe: -1304.629024 hartree
zpe.sumelectthermal: -1304.609880 hartree
zpe.sumelectthermalent: -1304.608936 hartree
zpe.sumelectthermalfe: -1304.678736 hartree
dipole: 7.4438 -1.8516 -1.3875
dipole: 7.7951
quadrupole: -149.4440 -131.2177 -114.1393
quadrupole: -5.3704 -3.8234 -4.7250
quadrupole: -17.8437 0.3827 17.4610 -5.3704 -3.8234 -4.7250
hfenergy: -1304.851038 hartree
pointgroup: C01[X(C10H12N4O4S1)]
dipole: 2.9020159 -0.6197462 -0.7743522 debye
polarizability: 368.968622|16.8693403|202.1181922|-29.1916437|-1.3577917|110.879303 unknown
InChI: InChI=1S/C10H12N4O4S/c1-7(19-2)6-11-12-9-4-3-8(13(15)16)5-10(9)14(17)18/h3-7,12H,1-2H3
charge 0 multiplicity 1
31 atoms
S  5.728098 -0.362891 0.548721
O  -2.143161 3.009365 0.707515
O  0.083241 2.942441 0.234107
O  -3.963426 -2.98238 0.29312
O  -4.874429 -0.937075 0.753736
N  1.242953 0.668171 -0.294333
N  2.329309 -0.140867 -0.625221
N  -1.080865 2.352499 0.400261
N  -3.877829 -1.699857 0.446038
C  -0.000635 0.105091 -0.115217
C  -1.157457 0.901767 0.226526
C  4.714969 -0.320436 -1.092556
C  -0.189919 -1.309259 -0.263752
C  -2.424874 0.307175 0.409969
C  -2.555716 -1.076987 0.255313
C  -1.439884 -1.893861 -0.083289
C  3.480351 0.4733 -0.800754
C  5.607463 0.308638 -2.174618
C  4.681209 -1.592549 1.51627
H  4.455778 -1.364869 -1.332303
H  0.684281 -1.907026 -0.527216
H  -3.286387 0.927897 0.669106
H  -1.587909 -2.970941 -0.196617
H  1.29545 1.701941 -0.176463
H  3.606393 1.567793 -0.693687
H  6.522637 -0.291507 -2.312543
H  5.066763 0.351757 -3.13742
H  5.907788 1.336793 -1.901694
H  5.044316 -1.561439 2.55508
H  4.803382 -2.60621 1.104544
H  3.621509 -1.291973 1.483974
