program: Gaussian 09
title: 000228090
version: EM64L-G09RevD.01
frameworkgroup: C1[X(C9H17NO4)]
method: RPBEPBE
basis: SDD
operation: Freq
keyword: #p
keyword: freq=noraman
keyword: PBEPBE/SDD
title: #p freq=noraman PBEPBE/SDD
converged: YES YES NO NO
title: Mulliken charges:
elementType: O O O O N C C C C C C C C C H H H H H H H H H H H H H H H H H
charge: -0.295163 -0.205180 -0.207857 -0.234306 0.120897 -0.051797 -0.129071 -0.057470 -0.381712 -0.729724 -0.714963 -0.697482 0.299437 -0.763290 0.280606 0.280759 0.226344 0.231204 0.235188 0.219424 0.229212 0.230669 0.231330 0.218087 0.233976 0.217525 0.226054 0.233656 0.251520 0.251137 0.250990
chargesum: 0.00000
title: Mulliken charges with hydrogens summed into heavy atoms:
elementType: O O O O N C C C C C C C C C
charge: -0.295163 -0.205180 -0.207857 -0.234306 0.120897 0.228809 0.151688 0.168874 0.084680 -0.050419 -0.031570 -0.020247 0.299437 -0.009643
polarizability: 1.31088515e+02 7.40072239e+00 1.13908443e+02 3.12958733e+00 -8.70551053e-01 1.08799058e+02
1716.lowfreq: -50.8197 -12.0686 -6.3363 -0.0007 -0.0005 -0.0004 6.1187 32.0587 45.4652
frequency: -50.7711 31.6540 45.4590 64.0454 74.7382 80.4676 84.7628 125.3128 134.2408 182.1025 203.3964 217.9601 237.2337 250.2635 263.5692 281.0030 293.1296 321.3251 400.7083 414.4346 490.0032 491.9390 543.7150 577.4352 617.4697 643.2742 687.6571 770.5300 814.6913 821.9213 869.9414 905.9120 921.6253 929.1253 954.0172 966.6731 997.0800 1033.7514 1044.9723 1060.6152 1077.7693 1108.8816 1136.0462 1156.2784 1185.1886 1203.1680 1212.1997 1241.5017 1252.8626 1285.6553 1289.5449 1313.7572 1338.4314 1342.4233 1367.0066 1384.3074 1386.1287 1401.5481 1407.0219 1423.5748 1454.9349 1457.9716 1459.6918 1467.2522 1477.6768 1483.7855 1486.6027 1487.4569 1497.6815 1649.4898 2979.3682 2984.7333 2986.5035 2988.5285 3008.3784 3008.5791 3029.0298 3063.0631 3073.4010 3079.0546 3079.4688 3081.7118 3086.2075 3091.6888 3093.4687 3096.4562 3139.4822
redmass: 1.0786 5.1109 6.9101 3.7711 2.5776 3.6999 2.9756 3.3584 3.5802 2.3161 1.2603 1.7196 3.4247 1.7096 1.4248 3.5035 3.0688 3.3369 2.8203 3.3488 3.5969 4.0802 3.0992 3.3393 5.8164 3.4943 4.7075 2.4150 3.0016 3.0177 2.7388 1.9365 1.5318 2.6569 2.3491 1.4172 1.8237 2.5184 1.6256 1.7116 1.7416 2.2212 2.3594 2.4796 3.1933 1.9244 2.2375 1.5971 2.1580 1.2613 1.1944 1.4571 1.4096 1.4325 1.3745 1.2061 1.2201 1.2200 1.2491 3.0897 1.0654 1.0497 1.0948 1.0598 1.0534 1.0578 1.0451 1.0563 1.0541 10.8741 1.0360 1.0364 1.0666 1.0521 1.0613 1.0368 1.0850 1.0977 1.0992 1.0973 1.0949 1.0992 1.0976 1.0998 1.0985 1.0970 1.1012
irintensity: 1.4525 2.3699 2.0046 0.1813 0.1813 0.1445 0.6271 3.2242 2.0070 2.6363 1.1995 4.3544 0.5179 2.6344 1.2890 3.0458 0.7699 3.8736 1.1140 4.1652 1.1377 13.0653 8.1685 2.1254 3.7585 5.3879 2.7357 30.7480 19.0394 4.2558 0.2978 9.8583 6.6539 66.8515 64.3509 0.2040 43.4173 3.6165 8.5173 3.0220 11.6941 0.2330 3.7408 67.4089 347.7617 5.3298 24.3851 3.3374 27.6472 19.2807 3.3082 5.0680 2.7602 1.6254 5.9769 28.8925 58.9624 10.0761 27.8216 84.1874 13.2760 15.4031 3.8995 2.0755 12.5070 4.2857 10.1057 21.4755 13.4834 177.0709 21.7725 24.9672 19.6638 14.4054 13.1408 1.7977 4.0685 2.5632 13.4596 26.8002 1.0694 49.9775 24.4505 26.6849 30.9518 5.4830 8.3757
temp: 298.150 k
press: 1.00000 atm
elementType: 8 8 8 8 7 6 6 6 6 6 6 6 6 6 1 1 1 1 1 1 1 1 1 1 1 1 1 1 1 1 1
symmnumber: 1
zpe: 670824.6 jmol-1
zpe.correction: 0.255504 hartree
zpe.thermalcorrener: 0.271764 hartree
zpe.thermalcorrenthalpy: 0.272709 hartree
zpe.thermalcorrgfe: 0.210842 hartree
zpe.sumelectzpe: -707.600470 hartree
zpe.sumelectthermal: -707.584209 hartree
zpe.sumelectthermalent: -707.583265 hartree
zpe.sumelectthermalfe: -707.645132 hartree
dipole: -2.9666 -1.8302 2.7641
dipole: 4.4486
quadrupole: -92.4548 -77.3460 -91.7440
quadrupole: -0.4976 -4.5452 0.1906
quadrupole: -5.2732 9.8356 -4.5624 -0.4976 -4.5452 0.1906
hfenergy: -707.8559733 hartree
pointgroup: C01 [X(C9H17N1O4)]
dipole: -1.0647965 0.8946073 -1.0626285 debye
polarizability: 128.7717156|-9.3495266|116.2079175|-3.5241133|-0.2311188|108.816383 unknown
InChI: InChI=1S/C9H17NO4/c1-5-8(10(12)13)9(6(2)3)14-7(4)11/h6,8-9H,5H2,1-4H3
charge 0 multiplicity 1
31 atoms
O  -1.405659 0.615827 -0.486514
O  2.950696 -0.957471 -0.660914
O  2.322924 -0.374652 1.452018
O  -2.750675 0.273696 1.394167
N  2.166956 -0.371575 0.175084
C  -0.339168 -0.250168 0.121712
C  0.97023 0.40898 -0.390165
C  -0.623737 -1.722209 -0.28848
C  1.113313 1.887749 0.036197
C  -0.436797 -1.976861 -1.802369
C  0.164968 -2.747017 0.567125
C  2.416846 2.545722 -0.461571
C  -2.583162 0.783305 0.264942
C  -3.577562 1.643409 -0.482883
H  -0.402829 -0.155186 1.222684
H  1.061977 0.302975 -1.483213
H  -1.695674 -1.864469 -0.042839
H  1.049349 1.944536 1.139206
H  0.237542 2.418276 -0.376786
H  -0.826758 -2.976072 -2.067394
H  -0.980471 -1.228452 -2.407144
H  0.631048 -1.954318 -2.088754
H  0.092197 -2.518472 1.645671
H  -0.255642 -3.756212 0.406774
H  1.233236 -2.792474 0.293876
H  2.511739 2.473408 -1.560828
H  2.430296 3.616234 -0.191158
H  3.311333 2.078704 -0.01154
H  -4.488091 1.053138 -0.68736
H  -3.159822 2.01277 -1.430222
H  -3.8777 2.493479 0.153582
