program: Gaussian 09
title: 000228084
version: EM64L-G09RevD.01
frameworkgroup: C1[X(C8H17NO)]
method: RPBEPBE
basis: SDD
operation: Freq
keyword: #p
keyword: freq=noraman
keyword: PBEPBE/SDD
title: #p freq=noraman PBEPBE/SDD
converged: YES YES NO NO
title: Mulliken charges:
elementType: O N C C C C C C C C H H H H H H H H H H H H H H H H H
charge: -0.265998 -0.620228 -0.128817 -0.078364 -0.063139 -0.731974 -0.735283 -0.735603 -0.723512 0.178233 0.181608 0.249533 0.213813 0.245777 0.193780 0.213760 0.226237 0.215245 0.203904 0.198322 0.217173 0.234304 0.197821 0.260330 0.216694 0.309794 0.326588
chargesum: 0.00000
title: Mulliken charges with hydrogens summed into heavy atoms:
elementType: O N C C C C C C C C
charge: -0.265998 0.016154 0.052791 0.171169 0.150674 -0.078657 -0.089896 -0.085804 -0.048666 0.178233
polarizability: 9.83806237e+01 2.19646062e+00 9.87159841e+01 -1.71536137e+00 -3.30429504e+00 9.02187318e+01
1716.lowfreq: -22.6406 -0.0010 -0.0009 -0.0005 0.8091 11.0545 49.4658 79.4090 102.1622
frequency: 49.1066 79.3359 102.1392 158.6927 171.8240 189.6835 198.7705 212.8053 239.5735 245.8780 303.2965 324.5581 354.5790 392.2842 423.0534 443.2261 485.8695 501.8685 589.0170 627.2109 718.6813 790.4169 850.6465 865.0509 917.8803 924.8242 935.8296 956.4189 963.8850 985.8615 1046.9531 1076.4915 1109.4960 1134.2724 1168.1002 1175.1528 1184.8324 1243.1516 1255.5474 1296.5300 1314.3132 1327.5293 1333.0297 1374.2258 1379.5802 1382.5131 1395.0336 1399.3388 1463.4988 1466.9731 1469.3456 1472.7493 1479.4377 1482.9480 1489.4923 1491.9839 1587.5586 1630.6292 2937.1648 2966.3062 2967.7784 2970.2708 2978.7206 2983.6366 3008.5990 3056.1583 3059.3748 3065.9231 3069.8294 3073.5318 3075.2313 3079.3685 3092.2265 3511.2861 3671.2695
redmass: 3.9201 2.8678 2.5128 3.4511 2.7637 1.6578 1.4110 1.0881 1.2788 1.1140 2.3067 3.1105 2.8553 2.2081 2.3591 2.4893 2.5625 1.1891 1.5005 2.3349 3.8229 2.9746 2.3875 2.5027 1.1936 1.1884 1.9146 1.4713 1.4243 1.8525 1.7595 2.1180 1.8028 2.0998 2.2108 1.9795 2.1547 1.5506 1.3518 1.6509 1.4605 1.3947 1.3615 1.5784 1.3954 1.2308 1.2088 1.2123 1.0508 1.0446 1.0588 1.0441 1.0543 1.0485 1.0474 1.0511 1.6188 2.6794 1.0820 1.0370 1.0368 1.0387 1.0663 1.0507 1.0834 1.0981 1.0985 1.0973 1.0989 1.0996 1.0991 1.0986 1.0992 1.0447 1.1039
irintensity: 8.7180 4.4824 1.3756 1.2051 0.2343 3.8572 2.3603 0.4627 1.8245 0.4335 0.1281 2.4163 0.9772 0.2991 1.0040 0.3762 1.8686 178.0060 71.1977 22.7068 23.0446 4.7183 2.3716 1.3940 4.3353 5.2790 0.3553 1.0182 0.2395 5.8213 1.0169 1.3602 3.0857 4.1871 2.2630 18.0108 10.5680 43.0491 7.5409 65.8104 7.2239 2.2250 1.3973 26.0627 43.7976 17.3756 23.6836 13.3590 1.4000 2.5868 6.6460 8.4384 10.6924 9.5977 20.6878 10.0795 47.7607 246.5850 31.0476 32.0332 37.8290 25.0724 36.7329 27.0199 8.2591 2.9386 29.0168 80.5602 53.4652 35.7394 37.2854 46.9777 26.6476 26.9264 18.7859
temp: 298.150 k
press: 1.00000 atm
elementType: 8 7 6 6 6 6 6 6 6 6 1 1 1 1 1 1 1 1 1 1 1 1 1 1 1 1 1
symmnumber: 1
zpe: 629233.6 jmol-1
zpe.correction: 0.239662 hartree
zpe.thermalcorrener: 0.252454 hartree
zpe.thermalcorrenthalpy: 0.253398 hartree
zpe.thermalcorrgfe: 0.201690 hartree
zpe.sumelectzpe: -444.213655 hartree
zpe.sumelectthermal: -444.200863 hartree
zpe.sumelectthermalent: -444.199919 hartree
zpe.sumelectthermalfe: -444.251628 hartree
dipole: 0.1104 0.1618 -3.6800
dipole: 3.6852
quadrupole: -62.9807 -59.3973 -66.5338
quadrupole: 2.4929 -3.1717 -6.5249
quadrupole: -0.0101 3.5733 -3.5632 2.4929 -3.1717 -6.5249
hfenergy: -444.4533175 hartree
pointgroup: C01 [X(C8H17N1O1)]
dipole: 0.07458 -0.1305017 -1.4420545 debye
polarizability: 98.4582262|2.0402904|97.6925158|-1.8338544|-4.2718453|91.1645977 unknown
InChI: InChI=1S/C8H17NO/c1-5(2)7(6(3)4)8(9)10/h5-7H,9H2,1-4H3
charge 0 multiplicity 1
27 atoms
O  0.618518 1.550665 1.272709
N  1.045782 2.07628 -0.938014
C  -0.047401 -0.100515 -0.446325
C  -1.487253 -0.26019 0.140183
C  0.921413 -1.29821 -0.130959
C  -2.395048 0.905873 -0.323899
C  -2.130736 -1.613549 -0.243355
C  2.310908 -1.08317 -0.780007
C  1.06709 -1.594721 1.380697
C  0.557603 1.228126 0.046283
H  -0.143355 -0.054066 -1.554518
H  -1.397062 -0.200773 1.242269
H  0.469102 -2.188545 -0.614294
H  -1.985799 1.885894 -0.020471
H  -2.50972 0.903575 -1.426156
H  -3.403933 0.812937 0.118611
H  -1.589904 -2.475992 0.184453
H  -3.171372 -1.657965 0.128115
H  -2.163922 -1.741894 -1.343379
H  2.22769 -0.872826 -1.864181
H  2.936094 -1.987092 -0.659698
H  2.84756 -0.239344 -0.308653
H  1.765283 -2.438753 1.534982
H  1.453823 -0.712602 1.919129
H  0.100705 -1.867644 1.841309
H  1.010475 1.834015 -1.926103
H  1.467061 2.961585 -0.654631
