program: Gaussian 09
title: 000228078
version: EM64L-G09RevD.01
frameworkgroup: C1[X(C8H6N2O6)]
method: RPBEPBE
basis: SDD
operation: Freq
keyword: #pfreq=noraman
keyword: PBEPBE/SDD
title: #p freq=noraman PBEPBE/SDD
converged: NO YES NO NO
title: Mulliken charges:
elementType: O O O O O O N N C C C C C C C C H H H H H H
charge: -0.399598 -0.427042 -0.214075 -0.301208 -0.205605 -0.200514 0.019097 -0.663293 0.311806 0.131972 0.294173 0.367688 -0.466362 -0.568407 0.083764 0.152087 0.324789 0.262400 0.324202 0.384808 0.392626 0.396691
chargesum: 0.00000
title: Mulliken charges with hydrogens summed into heavy atoms:
elementType: O O O O O O N N C C C C C C C C
charge: -0.006971 -0.030351 -0.214075 -0.301208 -0.205605 -0.200514 0.019097 0.045717 0.311806 0.131972 0.294173 0.367688 -0.141573 -0.306007 0.083764 0.152087
polarizability: 1.97655040e+02 -1.23097874e+01 1.56554561e+02 4.32632089e+00 6.15558868e+00 5.88320255e+01
1716.lowfreq: -0.0006 -0.0004 -0.0003 6.1892 7.7300 9.3566 34.3851 54.5710 87.5527
frequency: 34.3615 54.5678 87.5523 101.8058 126.9255 149.7809 176.2031 185.5264 251.3813 271.6806 306.3473 341.1772 367.8371 375.7970 431.2698 456.3936 484.3670 523.1104 533.1607 579.2105 599.9042 602.6439 627.9801 638.5476 668.7315 689.5566 713.4710 733.6102 749.5626 750.4044 797.2662 806.7070 892.6146 961.4865 969.9347 1018.3723 1059.3316 1080.1217 1141.5971 1159.5145 1217.5845 1270.4645 1294.2874 1314.3892 1350.0885 1364.0217 1417.1537 1458.2217 1495.0486 1541.4864 1586.3002 1630.6352 1644.2974 1651.3343 3149.6676 3191.1424 3384.2903 3525.9223 3537.0592 3633.3773
redmass: 11.7854 8.3038 11.3015 12.5123 6.8388 8.5252 6.8089 6.6579 7.2784 6.7669 6.9228 10.5025 4.6485 7.2159 7.4960 3.3847 4.4498 2.0785 1.1492 1.2466 2.4537 3.8043 5.6840 7.2983 5.2101 5.7082 6.6122 7.1469 6.7137 1.8014 1.7601 5.9410 1.6668 6.7752 1.5091 3.8370 2.2102 1.8429 1.6504 2.3764 5.8413 1.3161 2.2832 4.1830 3.5952 10.1795 7.4084 6.5108 3.7953 3.5663 6.3102 1.8005 5.4177 9.2738 1.0923 1.0921 1.0574 1.0642 1.0643 1.0940
irintensity: 0.9244 0.6677 0.8141 1.6076 0.7670 0.7544 3.4642 2.6781 1.5298 1.0532 3.8021 0.0431 18.0512 12.3227 15.6173 22.9790 27.0573 22.4354 58.0200 107.2498 98.4601 55.5689 58.0208 7.9142 42.5944 22.0288 29.4412 21.0659 13.9307 50.1972 121.6305 3.4315 40.1376 67.7710 5.5198 361.0778 34.3308 102.8783 152.1356 17.6368 471.9120 1.9823 26.2672 76.7047 138.6610 157.5412 7.6316 11.4256 21.9823 127.0815 226.7281 177.0420 381.6082 200.4574 2.0527 11.3263 213.3311 52.1552 77.8969 71.4151
temp: 298.150 k
press: 1.00000 atm
elementType: 8 8 8 8 8 8 7 7 6 6 6 6 6 6 6 6 1 1 1 1 1 1
symmnumber: 1
zpe: 377760.3 jmol-1
zpe.correction: 0.143881 hartree
zpe.thermalcorrener: 0.157933 hartree
zpe.thermalcorrenthalpy: 0.158877 hartree
zpe.thermalcorrgfe: 0.102244 hartree
zpe.sumelectzpe: -868.096822 hartree
zpe.sumelectthermal: -868.082770 hartree
zpe.sumelectthermalent: -868.081826 hartree
zpe.sumelectthermalfe: -868.138459 hartree
dipole: 4.4540 -3.8581 1.4430
dipole: 6.0668
quadrupole: -87.2693 -87.9460 -93.8784
quadrupole: 6.4929 -8.1391 -3.2709
quadrupole: 2.4286 1.7519 -4.1805 6.4929 -8.1391 -3.2709
hfenergy: -868.240703 hartree
pointgroup: C01 [X(C8H6N2O6)]
dipole: -1.7851339 1.4998352 0.5107373 debye
dipolederiv: -0.5860498 0.085144 -0.4298112 0.0085945 -0.4317725 0.1047343 -0.522346 0.0305811 -0.9520551 -0.4557565 -0.2996776 0.0203733 -0.6160797 -1.1967037 0.0615826 0.0385194 0.0589562 -0.416935 -0.7240226 -0.2675428 0.1408362 -0.256393 -0.5924858 0.3176694 -0.0629089 0.1790078 -0.6894913 -1.1971586 0.1621403 0.0070917 0.1416033 -0.6663938 0.01706 0.0080742 0.0170462 -0.3488259 -0.3889595 -0.0219185 0.0700103 0.2161269 -0.998105 0.1365773 0.0459803 0.138113 -0.2724367 -0.985239 0.0790586 0.1823871 -0.0276006 -0.4988507 0.0370219 0.2198752 0.0377315 -0.2806351 1.5197269 -0.4521491 -0.3039661 -0.6772905 1.5152367 -0.2069503 -0.2840607 -0.173148 0.3148066 -0.8843942 0.7128429 -0.0405952 0.5924684 -0.9405778 -0.0003803 -0.0344141 0.0080437 -0.6072782 -0.1304986 -0.1839529 -0.0214987 -0.159 0.5999366 0.0062265 0.12529 -0.0209019 0.0027841 -0.9932501 -0.2913751 0.0380169 0.2953353 -0.5071355 0.0121363 -0.0064235 0.0360818 -0.0646652 -0.8729085 0.305859 0.0634845 0.3177186 -0.6055919 0.0542363 -0.0211327 -0.0110816 -0.0109732 0.8577389 -0.8339316 0.0503384 -0.4717159 0.8989598 -0.0356737 0.001632 -0.0460262 0.1742782 0.807458 -0.1109067 -0.0199784 -0.3077646 -0.0190866 -0.0023456 -0.0680845 0.0399385 -0.0192337 -0.5067897 0.5740022 -0.0151498 -0.0185462 -0.0485477 -0.0125317 0.0360864 -0.0431046 -0.1734328 1.3661858 0.3100287 0.2623619 0.4170294 0.7847716 -0.4812959 0.4249444 -0.2640809 1.3041838 2.0040475 0.3083963 -0.0550056 0.5382855 1.4104005 -0.0886456 -0.0572468 -0.0857921 0.2521531 0.1523406 0.0112648 -0.0054654 -0.0159972 0.1043596 -0.000574 0.0208676 -0.0070736 0.1621435 0.0709813 -0.0021976 0.0004242 -0.0176256 -0.0352144 0.0058542 -0.016069 0.019077 0.1566092 0.1639506 -0.0635919 0.0095884 -0.1110045 0.2612918 0.0115624 0.011964 0.011211 0.3650921 0.4017633 -0.0036163 -0.0035982 0.0536947 0.2876252 0.0057582 -0.0025833 0.0069005 0.3662912 0.2014854 -0.0718876 0.0495021 -0.0485675 0.3086037 0.0584926 0.146399 0.0674132 0.3324659 0.1793489 0.0540107 0.0006535 0.1467287 0.3692799 -0.0005152 -0.0043628 0.0011072 0.4051544 unknown
polarizability: 198.1736322|-11.5519683|155.3063774|-4.1674239|-10.3018075|59.5616161 unknown
InChI: InChI=1S/C8H6N2O6/c9-5-1-4(8(13)14)6(10(15)16)2-3(5)7(11)12/h1-2,11,13H,9H2
charge 0 multiplicity 1
22 atoms
O  3.106764 0.813185 1.227736
O  -3.285064 -1.828755 0.213088
O  3.011394 1.985986 -0.783673
O  -4.090514 0.338939 0.086273
O  1.379777 -2.905502 0.282083
O  2.871123 -1.368316 -0.51616
N  1.706082 -1.70141 -0.054894
N  -2.291628 2.326517 -0.088532
C  1.060771 0.73016 -0.004737
C  -1.682746 -0.050194 0.069639
C  0.689341 -0.646957 0.048439
C  -1.332959 1.350445 -0.030596
C  -0.659648 -1.023602 0.101947
C  0.057375 1.699931 -0.058851
C  2.487134 1.214027 0.045505
C  -3.099276 -0.452115 0.117413
H  -0.918583 -2.083968 0.149159
H  0.342138 2.756198 -0.110613
H  -2.030227 3.306949 -0.169587
H  -3.279059 2.038722 -0.055251
H  4.061155 1.095401 1.220341
H  -4.258751 -2.02784 0.245671
