program: Gaussian 09
title: 000228069
version: EM64L-G09RevD.01
frameworkgroup: C1[X(C6H13NO2)]
method: RPBEPBE
basis: SDD
operation: Freq
keyword: #p
keyword: freq=noraman
keyword: PBEPBE/SDD
title: #p freq=noraman PBEPBE/SDD
converged: YES YES NO NO
title: Mulliken charges:
elementType: O O N C C C C C C H H H H H H H H H H H H H
charge: -0.420592 -0.230073 -0.607957 0.284460 -0.353196 -0.729946 -0.741192 -0.524410 0.170913 0.229606 0.204192 0.213886 0.212622 0.206880 0.237843 0.204157 0.216719 0.252199 0.269514 0.269901 0.259300 0.375175
chargesum: 0.00000
title: Mulliken charges with hydrogens summed into heavy atoms:
elementType: O O N C C C C C C
charge: -0.045417 -0.230073 -0.078756 0.284460 0.080601 -0.096558 -0.082473 -0.002697 0.170913
polarizability: 9.30469259e+01 -1.73379650e+00 7.72843841e+01 9.40764839e-01 1.11181802e+00 6.48011361e+01
1716.lowfreq: -9.4855 -0.0004 -0.0004 0.0008 2.1227 12.4864 19.4653 63.6556 87.0608
frequency: 18.3373 63.6422 86.7665 124.4872 200.7911 221.4594 231.1471 261.8906 299.2455 330.9119 382.0225 423.2208 471.2152 498.5283 507.8607 580.6193 638.2821 647.6591 744.9070 777.3714 870.1396 910.6762 916.2996 948.1840 979.9379 992.6459 1038.8154 1071.7082 1091.5166 1149.2317 1214.5072 1223.0040 1251.2177 1277.4259 1299.6988 1327.3581 1372.3136 1375.5951 1393.5116 1440.1047 1452.0701 1463.2170 1466.2461 1477.6162 1485.4602 1638.4283 1669.6874 2964.6198 2974.7370 2989.4325 3001.7485 3038.2091 3059.8565 3062.4288 3070.2203 3071.7237 3090.9073 3428.0856 3511.0214 3551.5754
redmass: 6.3002 3.0988 1.9802 3.9375 1.0540 1.2198 3.1368 1.0967 2.7829 2.2934 2.4125 2.3183 2.5905 3.1473 1.7599 4.1815 1.3544 1.4930 2.5436 1.7168 3.8450 1.7341 1.9154 1.8154 1.5381 1.3169 2.6424 1.5875 2.3542 1.4573 1.9051 1.6885 2.0919 1.7644 1.2594 2.0285 1.5460 1.3528 1.2293 1.0823 1.0898 1.0495 1.0603 1.0602 1.0607 1.0951 8.0465 1.0352 1.0371 1.0598 1.0600 1.0980 1.0989 1.0999 1.0982 1.1015 1.0998 1.0448 1.0639 1.0964
irintensity: 0.5886 1.2911 5.1704 2.1967 48.2598 11.9934 5.5908 10.0218 1.1185 2.9119 6.6278 6.1915 27.5440 1.0510 35.7047 26.7648 76.3290 225.5328 3.3810 26.0693 4.6854 4.8392 13.9347 1.3899 5.8806 2.8732 233.2126 4.5139 33.4482 6.2930 33.2915 19.0216 12.8901 6.6211 9.4278 80.7713 10.8317 30.0425 20.1569 16.5621 15.5991 0.3076 9.3286 8.2533 17.1299 47.4724 208.9622 29.3058 29.1846 9.3766 19.6901 1.5088 45.8319 2.5275 60.8270 37.3898 38.9552 2.8999 17.9608 0.4608
temp: 298.150 k
press: 1.00000 atm
elementType: 8 8 7 6 6 6 6 6 6 1 1 1 1 1 1 1 1 1 1 1 1 1
symmnumber: 1
zpe: 491195.9 jmol-1
zpe.correction: 0.187087 hartree
zpe.thermalcorrener: 0.198418 hartree
zpe.thermalcorrenthalpy: 0.199363 hartree
zpe.thermalcorrgfe: 0.149272 hartree
zpe.sumelectzpe: -440.897151 hartree
zpe.sumelectthermal: -440.885819 hartree
zpe.sumelectthermalent: -440.884875 hartree
zpe.sumelectthermalfe: -440.934966 hartree
dipole: -1.4466 -2.0070 0.7180
dipole: 2.5761
quadrupole: -47.8490 -59.2230 -57.8644
quadrupole: -1.9066 0.0638 0.6946
quadrupole: 7.1298 -4.2442 -2.8856 -1.9066 0.0638 0.6946
hfenergy: -441.0842377 hartree
pointgroup: C01 [X(C6H13N1O2)]
dipole: 0.5750722 -0.7903393 -0.2680567 debye
dipolederiv: -0.9292359 -0.5602341 0.0474155 -0.5114033 -0.7199993 0.0240969 0.0368215 0.0213482 -0.4338122 -0.7008873 0.1963654 -0.0107184 -0.0479626 -0.9510021 0.0500896 0.0080721 0.0516308 -0.3038463 -0.3786813 0.0868654 0.1292496 0.0992806 -0.3904989 0.0284716 0.0395689 0.0477379 -0.82727 0.315979 -0.0874011 0.026349 -0.1385767 0.3582288 -0.1138236 -0.0000921 -0.0392552 0.5449814 -0.0003376 0.0290755 -0.0152157 0.0289856 0.0231279 -0.015085 0.0336725 -0.0113223 0.0870533 0.001366 0.0242962 0.0369783 0.0570121 -0.0331146 -0.1192616 0.0271968 -0.0423774 -0.1516007 -0.013333 -0.0944443 0.0037899 -0.0456185 -0.0443844 0.0005827 -0.0221087 -0.0171992 0.013853 -0.3473903 0.0732141 0.0011575 0.2776398 -0.0940114 0.03563 -0.0548234 0.0344101 0.1463338 1.5084908 0.1716695 -0.0168353 0.2365698 1.4137475 -0.0978347 -0.0137193 -0.0977131 0.18738 0.0525116 0.0054029 0.0177124 -0.0049024 -0.0158924 -0.0971696 0.0374142 -0.111321 -0.0462331 0.0483889 0.0032228 -0.0176188 -0.018858 0.0075086 0.0979404 -0.0311001 0.1104681 -0.082502 0.0927045 0.0262492 -0.034174 0.01494 -0.0062624 0.1392964 -0.0133261 0.0947127 -0.1200321 -0.177125 0.1028768 0.0322863 0.0700848 0.0615429 -0.0127267 -0.0176248 -0.001093 0.0708137 -0.006978 -0.1514297 -0.031187 -0.1448271 -0.0868837 -0.041123 -0.0125596 -0.0074549 0.0575443 0.0862885 0.0209298 0.0475644 -0.0029423 0.0282982 -0.0932987 0.0096059 -0.1285997 -0.0872471 -0.1959654 0.0407105 0.0035862 0.1085385 0.0362234 0.0015652 0.0009634 -0.0060486 0.0925146 0.0893747 0.0329801 -0.0453358 0.0007814 -0.0135714 0.0990569 -0.0142741 0.1378602 -0.0444144 0.0824174 0.0087391 -0.0021397 -0.0316974 0.0002744 -0.089251 -0.0029432 -0.1051469 0.0003523 0.1177851 0.0085226 0.0001732 -0.0331247 0.0439031 0.072044 0.0454428 0.080897 -0.0076826 -0.050555 0.0450916 -0.0845755 0.0565197 0.1789551 0.0920464 0.0541463 0.0309951 0.2893497 0.2315681 -0.0835782 -0.0817703 -0.1250798 -0.0094707 0.0257341 -0.0964435 -0.0560383 0.2279749 0.173614 0.1008761 -0.006692 0.1546405 0.2132813 0.0130197 -0.0138895 0.0135095 0.3864895 unknown
polarizability: 93.0221208|1.9268049|77.2570295|0.5404891|-1.4705768|64.8532959 unknown
InChI: InChI=1S/C6H13NO2/c1-6(2,7)4-3-5(8)9/h8H,3-4,7H2,1-2H3
charge 0 multiplicity 1
22 atoms
O  -3.183966 -0.943964 0.082417
O  -2.53189 1.276744 -0.089209
N  1.903468 -0.887996 1.163775
C  1.733978 -0.014906 -0.035728
C  0.284601 0.557883 -0.041358
C  2.033469 -0.779142 -1.360589
C  2.72289 1.1652 0.11376
C  -0.815646 -0.513847 0.055373
C  -2.211916 0.072042 0.005905
H  0.182577 1.24289 0.81974
H  0.134775 1.162152 -0.956313
H  1.896554 -0.130211 -2.246348
H  3.076828 -1.146537 -1.362805
H  1.370185 -1.6574 -1.478256
H  2.560432 1.678645 1.078139
H  3.771698 0.811544 0.077981
H  2.5861 1.899095 -0.700198
H  -0.746331 -1.263061 -0.757091
H  -0.723383 -1.072945 1.006638
H  2.88415 -0.983564 1.452682
H  1.462843 -1.810775 1.065564
H  -4.088316 -0.527847 0.052621
