program: Gaussian 09
title: 000228068
version: EM64L-G09RevD.01
frameworkgroup: C1[X(C6H12N2O5)]
method: RPBEPBE
basis: SDD
operation: Freq
keyword: #p
keyword: freq=noraman
keyword: PBEPBE/SDD
title: #p freq=noraman PBEPBE/SDD
converged: YES YES NO NO
title: Mulliken charges:
elementType: O O O O O N N C C C C C C H H H H H H H H H H H H
charge: -0.468108 -0.178649 -0.172695 -0.161022 -0.183444 0.098639 0.109644 0.280765 -0.424702 -0.404046 -0.027320 -0.700723 -0.713083 0.252083 0.282517 0.219083 0.224723 0.195970 0.268827 0.249028 0.236934 0.222399 0.231863 0.213604 0.347710
chargesum: 0.00000
title: Mulliken charges with hydrogens summed into heavy atoms:
elementType: O O O O O N N C C C C C C
charge: -0.120398 -0.178649 -0.172695 -0.161022 -0.183444 0.098639 0.109644 0.280765 0.109899 0.039761 0.168650 0.054066 -0.045217
polarizability: 1.09782024e+02 -2.55794684e+00 9.86205588e+01 -2.72957433e+00 6.87315665e+00 8.97373211e+01
1716.lowfreq: -6.3507 -1.9391 0.0007 0.0009 0.0012 10.0122 33.5724 43.4164 54.4073
frequency: 33.1017 43.3840 54.4063 63.6212 89.4688 119.6712 165.8534 184.9740 206.6553 231.9578 244.0015 283.1769 290.5612 305.6609 331.2492 383.0934 403.8647 421.4275 460.6521 470.0889 533.6490 606.8333 669.4554 713.0886 756.3767 765.4110 769.8292 828.3907 907.6957 920.7643 954.3644 1030.0854 1046.6029 1065.7017 1079.5745 1109.1172 1129.1428 1183.7095 1190.9305 1227.2614 1241.6621 1262.0343 1280.7489 1300.6163 1330.2981 1350.5605 1383.9519 1389.4490 1390.8743 1417.2468 1423.7188 1441.2901 1456.7446 1460.7155 1470.0898 1472.5764 1473.7092 2939.5188 2978.0617 2995.2695 3016.5444 3023.1949 3056.1215 3070.3080 3088.1731 3095.3051 3118.2420 3134.1064 3572.0763
redmass: 3.7360 10.6244 11.6097 4.9367 3.9879 3.4556 5.4875 1.3484 2.6526 1.8474 1.3776 3.3213 1.1960 3.6060 2.6330 4.5274 5.1272 3.8798 5.7842 2.4407 4.6387 4.9329 4.8145 7.0485 4.5291 2.8802 2.9646 2.4043 2.4083 1.9342 1.5593 1.6290 3.3230 1.4893 1.8663 2.4717 1.9688 9.3130 1.5495 8.8256 1.9800 1.7583 1.3388 1.1923 1.2447 1.3669 1.6387 1.2205 1.3710 4.0597 7.6688 1.1310 1.0839 1.1470 1.0737 1.0666 1.0626 1.0842 1.0365 1.0590 1.0369 1.0594 1.1018 1.0986 1.1001 1.1029 1.0996 1.1005 1.0663
irintensity: 1.8554 0.4782 0.1773 3.0151 1.1128 0.9023 6.2196 0.7810 2.4945 0.4084 0.4023 15.2061 134.4604 0.8810 1.7816 9.8791 2.7762 10.8223 11.0413 4.9612 3.7963 2.1937 1.1398 11.5795 34.9961 8.1014 23.6359 14.8086 1.6520 19.2910 2.7342 16.2564 7.6612 59.0989 10.8966 18.4421 2.1332 110.9951 2.9867 36.2586 14.5486 56.8754 17.6326 2.4741 9.8581 9.3815 20.6290 19.3495 95.8656 37.9648 180.2289 7.9692 11.5126 2.1583 10.8012 21.4346 14.5989 47.6776 21.2441 15.7106 3.5031 4.3099 13.2100 35.7031 26.4756 17.5674 3.3541 3.2555 4.5043
temp: 298.150 k
press: 1.00000 atm
elementType: 8 8 8 8 8 7 7 6 6 6 6 6 6 1 1 1 1 1 1 1 1 1 1 1 1
symmnumber: 1
zpe: 501881.7 jmol-1
zpe.correction: 0.191157 hartree
zpe.thermalcorrener: 0.206076 hartree
zpe.thermalcorrenthalpy: 0.207021 hartree
zpe.thermalcorrgfe: 0.148068 hartree
zpe.sumelectzpe: -720.236656 hartree
zpe.sumelectthermal: -720.221736 hartree
zpe.sumelectthermalent: -720.220792 hartree
zpe.sumelectthermalfe: -720.279745 hartree
dipole: 5.7182 -0.5100 1.5182
dipole: 5.9382
quadrupole: -75.2701 -85.9997 -77.0764
quadrupole: -1.0403 -7.8703 -0.3349
quadrupole: 4.1786 -6.5509 2.3724 -1.0403 -7.8703 -0.3349
hfenergy: -720.4278124 hartree
pointgroup: C01 [X(C6H12N2O5)]
dipole: -2.2503512 -0.1949851 -0.5967677 debye
dipolederiv: -0.3943486 0.0031411 -0.1789041 0.0136195 -0.7968618 -0.0902313 -0.2102527 -0.1151595 -0.4716159 -0.8125371 -0.0427206 0.1381846 0.0395509 -0.3889864 0.1332852 0.0251775 0.1439213 -0.283684 -0.1446167 -0.0735761 0.0026021 -0.0490318 -0.6308916 0.270845 -0.0577671 0.0589064 -0.5758396 -0.5169602 0.0495994 0.0086581 -0.1340297 -0.5820529 0.273354 0.1345027 0.2880395 -0.3036119 -0.1996337 -0.0357714 -0.0752182 -0.0748458 -0.4637552 -0.1151321 -0.0373309 0.0126453 -0.7194046 1.0485235 -0.1018491 -0.1203054 -0.0037462 0.8507683 -0.506918 -0.1348399 -0.5597767 0.3091418 -0.0245056 0.1634777 0.0629023 0.1696748 1.0639197 -0.1453553 0.0989261 -0.038541 1.0287211 0.4488804 0.0081397 -0.0375525 0.0870187 -0.0074629 0.1191702 -0.0880256 0.1646038 0.3604401 -0.0967132 0.0484737 0.0360392 -0.0224308 -0.0881641 0.0002595 0.0457271 -0.0122665 -0.0169704 -0.0683654 -0.0160976 0.0172634 -0.0789437 0.0596164 0.0343725 0.0791921 0.0329137 0.1120022 0.4521897 0.0510878 0.0717371 0.0925613 0.6176852 0.1071588 0.0554606 0.0928156 0.418406 -0.1099316 0.0544397 0.0135219 0.011265 -0.0567155 0.0160175 0.0477448 -0.0034236 -0.1455018 -0.1376944 0.1376626 -0.0183273 0.0476622 -0.0841567 -0.0070598 -0.0299171 -0.0007533 0.0404574 0.0530395 0.0094323 -0.0044768 -0.014551 0.0860904 -0.000464 -0.0101528 0.0078271 -0.0539803 0.1546184 -0.0129238 -0.0097075 0.0326933 0.0073199 -0.0466202 0.0426623 -0.0247176 0.0780011 0.0707989 -0.0046257 -0.0039266 0.0281422 0.0707105 0.0284415 -0.0048952 0.0459912 -0.1201162 0.0595816 -0.0330664 -0.0158363 -0.0007642 -0.0848159 -0.0604484 -0.0178901 -0.081546 0.0342082 0.0089504 0.0073551 -0.0453405 -0.0145701 -0.0353744 0.0412782 -0.0286631 0.0023805 -0.2203136 -0.0285483 -0.0315045 0.0574212 -0.0272964 0.112788 0.0160632 0.0148497 -0.0093513 0.0896338 0.0569781 0.0722199 -0.037695 0.0902724 0.0522019 0.0410351 -0.0747138 0.0306435 0.0887775 0.1118002 -0.0551648 -0.0153818 -0.0468012 -0.0443262 -0.0651246 -0.0101154 -0.0367143 0.0776581 0.0965707 -0.0429361 -0.0364584 -0.0019528 -0.0928208 -0.0978024 -0.0215345 -0.1039264 0.0407091 0.0849209 0.0110327 0.0228769 0.0211045 0.0825564 0.0258117 -0.0405293 0.0637438 -0.1244371 -0.1569586 -0.0523864 0.0601552 -0.1042761 0.0314123 0.0437978 0.0690266 0.0425853 0.0740245 0.043961 -0.113439 0.1077685 -0.0603252 0.3213154 -0.0157341 0.153358 -0.0008405 0.2832944 unknown
polarizability: 109.8795938|2.2701066|97.8565529|-2.8765756|-7.2192995|90.4037572 unknown
InChI: InChI=1S/C6H12N2O5/c1-5(9)3-4-6(2,7(10)11)8(12)13/h5,9H,3-4H2,1-2H3
charge 0 multiplicity 1
25 atoms
O  -3.183974 -1.377351 -0.395066
O  3.176943 -0.699585 -0.119907
O  1.268576 2.292155 -0.640394
O  1.643913 -2.049086 0.894246
O  1.359542 1.396917 1.455534
N  1.97902 -1.032964 0.195899
N  1.204814 1.316783 0.184398
C  0.830499 -0.107489 -0.379775
C  -0.521396 -0.513175 0.218298
C  -1.672034 0.459825 -0.126892
C  -3.020315 -0.107474 0.350542
C  0.943978 -0.123629 -1.901092
C  -4.1928 0.850286 0.085073
H  -0.410011 -0.592031 1.314524
H  -0.78184 -1.515668 -0.161846
H  -1.74464 0.617133 -1.219459
H  -1.512031 1.445689 0.349282
H  -2.958554 -0.326926 1.440403
H  1.964615 0.138537 -2.219708
H  0.242983 0.601913 -2.340046
H  0.69036 -1.131797 -2.271105
H  -4.051383 1.806244 0.62209
H  -4.279156 1.064186 -0.995331
H  -5.150433 0.414637 0.428072
H  -4.046275 -1.794732 -0.145441
