program: Gaussian 09
title: 000228067
version: EM64L-G09RevD.01
frameworkgroup: C1[X(C5H10N2O5)]
method: RPBEPBE
basis: SDD
operation: Freq
keyword: #p
keyword: freq=noraman
keyword: PBEPBE/SDD
title: #p freq=noraman PBEPBE/SDD
converged: YES YES NO NO
title: Mulliken charges:
elementType: O O O O O N N C C C C C H H H H H H H H H H
charge: -0.429163 -0.173882 -0.167095 -0.162368 -0.180471 0.099233 0.107417 0.304086 -0.433182 -0.406493 -0.703423 -0.328012 0.244311 0.260263 0.216086 0.234289 0.273102 0.232553 0.256635 0.195941 0.222319 0.337853
chargesum: 0.00000
title: Mulliken charges with hydrogens summed into heavy atoms:
elementType: O O O O O N N C C C C C
charge: -0.091310 -0.173882 -0.167095 -0.162368 -0.180471 0.099233 0.107417 0.304086 0.071392 0.043883 0.058867 0.090248
polarizability: 9.45766723e+01 7.36948895e-01 9.11605057e+01 8.39837643e-01 6.83617351e+00 7.88878171e+01
1716.lowfreq: -0.0005 -0.0003 0.0002 8.7855 11.4116 11.7250 45.1462 53.2655 56.2095
frequency: 45.1102 53.2340 56.1281 62.2775 98.0753 130.0894 166.3280 197.8623 231.6380 251.1709 289.8974 307.4701 327.2952 333.1251 393.9001 450.8497 456.4785 525.7119 605.9776 667.3880 712.3498 752.8136 762.6503 770.0799 860.1722 907.7876 975.1322 1013.2525 1036.7803 1051.6118 1084.7287 1109.2917 1176.8740 1184.2040 1225.1213 1235.7879 1263.2166 1284.4998 1306.7421 1336.8866 1361.8374 1384.5375 1393.3142 1418.6657 1425.1461 1450.6708 1460.7147 1466.4758 1472.8500 1482.5488 2958.5868 2983.2363 3014.0866 3015.9434 3047.6524 3072.4449 3085.2973 3116.6354 3133.3189 3563.1311
redmass: 9.9274 9.0272 2.3145 3.8437 6.1528 2.8727 8.1590 1.1632 3.8788 3.2808 4.2126 3.1820 1.2407 2.7260 11.9128 4.4303 6.5787 5.0566 5.1015 4.7254 7.3061 3.0584 2.5613 2.5220 1.3629 2.7503 4.0102 1.5499 3.3005 2.9723 1.4710 1.7672 2.2700 4.0160 8.3537 2.9276 1.2709 1.5926 1.1075 1.2769 1.3435 1.2579 1.3297 4.3428 7.5594 1.1044 1.1555 1.0872 1.0722 1.0896 1.0683 1.0628 1.0527 1.0435 1.0953 1.0992 1.1025 1.0993 1.1005 1.0664
irintensity: 1.4784 0.1799 4.1734 5.1829 5.1884 2.6200 4.7767 0.6540 1.0295 0.7152 2.5988 10.6426 153.3987 7.0670 1.5778 13.7469 2.9937 7.3500 2.9826 0.4623 12.2671 48.6297 5.0956 19.0825 1.8790 6.3436 83.4338 2.0965 4.4862 23.3376 4.4611 30.0230 19.0712 100.4839 28.5681 46.1591 23.9803 6.8081 0.7896 1.4503 13.8639 18.4770 100.4471 34.7438 187.8904 5.8182 2.4795 6.9382 18.2632 10.9863 51.2286 15.8778 3.8368 4.6085 7.7052 10.5248 36.2351 3.6305 2.4409 9.4889
temp: 298.150 k
press: 1.00000 atm
elementType: 8 8 8 8 8 7 7 6 6 6 6 6 1 1 1 1 1 1 1 1 1 1
symmnumber: 1
zpe: 430698.0 jmol-1
zpe.correction: 0.164044 hartree
zpe.thermalcorrener: 0.177572 hartree
zpe.thermalcorrenthalpy: 0.178516 hartree
zpe.thermalcorrgfe: 0.122690 hartree
zpe.sumelectzpe: -681.004203 hartree
zpe.sumelectthermal: -680.990675 hartree
zpe.sumelectthermalent: -680.989731 hartree
zpe.sumelectthermalfe: -681.045557 hartree
dipole: -2.1994 -0.4620 1.9383
dipole: 2.9678
quadrupole: -88.3780 -76.9844 -69.3907
quadrupole: -2.8361 8.5986 -1.2491
quadrupole: -10.1270 1.2666 8.8603 -2.8361 8.5986 -1.2491
hfenergy: -681.168247 hartree
pointgroup: C01 [X(C5H10N2O5)]
dipole: -0.8718684 -0.2049926 0.7490847 debye
dipolederiv: -0.9248376 0.141042 -0.1122894 0.2175421 -0.3147024 -0.1983737 -0.0980468 -0.1861072 -0.423606 -0.7957327 -0.1106062 -0.082853 -0.0257957 -0.433998 -0.1264517 0.0155246 -0.118805 -0.2349322 -0.1351271 -0.0195407 0.0073655 0.0064691 -0.6678251 -0.2520351 0.0394294 -0.0361107 -0.5361064 -0.5040085 0.0532713 0.0262594 -0.1427473 -0.6730631 -0.2120208 -0.0601201 -0.2501958 -0.2248401 -0.1895519 -0.0054926 0.0299812 -0.0299839 -0.4606726 0.0863004 -0.0057468 -0.0458669 -0.7310391 1.0503872 -0.0652396 0.0274063 0.0500732 0.995855 0.4172755 0.0152808 0.4782264 0.1578661 -0.0360492 0.0383433 -0.0211412 0.0173875 1.1151557 0.1222968 -0.0286594 0.0087768 1.0231013 0.4211216 0.0705122 0.0384567 0.149866 -0.0475094 -0.0563992 0.0854653 -0.0944978 0.3861337 -0.0901231 0.0347435 -0.0366489 -0.0200092 -0.0244237 -0.0282029 -0.0646052 0.0042237 -0.0220516 -0.1616473 0.0251556 -0.0434457 -0.1432264 0.0679088 -0.0679428 -0.1035458 -0.0697494 0.0849915 -0.1242628 0.0418769 -0.0192982 -0.0013621 -0.0500013 -0.0351172 -0.0465254 -0.016742 -0.1411552 0.7334363 -0.1268251 0.0048185 -0.09875 0.3664111 0.0681573 0.0624012 0.0554009 0.3610762 0.0727975 -0.0263131 0.0132793 0.0127156 -0.0419895 0.0693193 -0.0228277 0.0527847 0.0701427 0.0689828 0.003578 0.0011949 -0.0088865 0.0869294 -0.0066076 0.0141812 -0.0230088 -0.0500914 0.0508569 -0.0250449 0.012234 0.0000918 -0.1204254 0.0538863 -0.0040395 0.0710377 0.0383507 0.0708665 0.0008323 -0.0033018 0.0071668 0.0622536 -0.0249523 0.0021837 -0.0242622 -0.1279187 -0.0140869 -0.0519605 -0.0423535 -0.0444354 0.1029885 -0.0228755 -0.0048958 0.0083348 0.0974209 0.1209956 -0.0321965 0.0120172 -0.0231829 -0.042514 0.085397 0.0075633 0.0540259 0.0591542 0.0395144 0.0709285 0.0292765 0.0925388 0.0680113 -0.0308232 0.0624048 -0.0196569 0.0943516 -0.0354391 0.0437348 0.0592001 0.012225 0.0470869 -0.0194043 0.0328754 -0.0672209 -0.2014459 0.0347144 0.0128057 0.0059793 -0.0013735 -0.1141916 0.0435577 0.0028956 0.0826276 0.0552723 0.3471929 -0.073605 0.0938628 -0.026323 0.0787159 0.1350162 0.0988072 0.1367853 0.2653254 unknown
polarizability: 94.5848084|0.6057843|90.4871173|1.0468541|7.3625684|79.5530694 unknown
InChI: InChI=1S/C5H10N2O5/c1-5(6(9)10,7(11)12)3-2-4-8/h8H,2-4H2,1H3
charge 0 multiplicity 1
22 atoms
O  -4.448668 0.055121 0.074721
O  3.006723 -0.423445 0.106168
O  0.777886 2.328483 0.337017
O  1.642779 -2.101231 -0.620795
O  0.842606 1.180065 -1.63331
N  1.858335 -0.956866 -0.093738
N  0.773381 1.253534 -0.354387
C  0.609627 -0.119504 0.406846
C  -0.689303 -0.77559 -0.080734
C  -1.960941 0.028787 0.27879
C  0.761488 0.084908 1.910494
C  -3.21796 -0.644628 -0.310908
H  -0.742001 -1.785028 0.365728
H  -0.618788 -0.911208 -1.175421
H  -1.889319 1.064072 -0.112462
H  -2.092414 0.099662 1.374016
H  1.746634 0.515632 2.147132
H  0.655455 -0.887148 2.422386
H  -0.016206 0.769928 2.280388
H  -3.128217 -0.724905 -1.415945
H  -3.341465 -1.661127 0.100125
H  -4.459933 0.952188 -0.345212
