program: Gaussian 09
title: 000228052
version: EM64L-G09RevD.01
frameworkgroup: C1[X(C17H15N)]
method: RPBEPBE
basis: SDD
operation: Freq
keyword: #pfreq=noraman
keyword: PBEPBE/SDD
title: #p freq=noraman PBEPBE/SDD
converged: YES YES NO NO
title: Mulliken charges:
elementType: N C C C C C C C C C C C C C C C C C H H H H H H H H H H H H H H H
charge: -0.076261 0.075058 0.334276 -0.539547 -0.559689 0.127720 -0.207515 -0.212733 -0.398782 -0.384028 -0.245289 -0.379570 0.434899 -0.368970 -0.373552 -0.234215 -0.220850 -0.231319 0.231425 0.245640 0.223209 0.224574 0.210533 0.209109 0.235133 0.244281 0.225155 0.222859 0.228041 0.271083 0.229276 0.229262 0.230786
chargesum: 0.00000
title: Mulliken charges with hydrogens summed into heavy atoms:
elementType: N C C C C C C C C C C C C C C C C C
charge: -0.076261 0.075058 0.334276 -0.062482 -0.111905 0.127720 0.003018 -0.003624 -0.163648 -0.139747 -0.020134 -0.156710 0.434899 -0.140929 -0.102469 -0.004939 0.008412 -0.000533
polarizability: 3.47187389e+02 2.25094695e+01 1.83173956e+02 -6.59999954e+00 1.26592782e+01 9.58572199e+01
1716.lowfreq: -12.3719 -1.1854 -0.0007 -0.0006 -0.0003 3.6056 31.7348 43.9202 52.8024
frequency: 31.6905 43.8416 52.7986 61.5437 107.3041 140.7121 180.1099 219.9074 235.5764 270.4007 314.0331 375.8336 376.9027 404.9564 437.6422 481.1641 484.5041 495.3259 535.0274 542.5009 570.8174 614.6885 622.6163 670.9516 698.2199 704.8102 720.7664 757.9579 770.4174 784.5683 837.9763 852.6439 857.4964 888.8249 925.1884 929.5392 945.0767 956.7835 970.2441 975.5790 982.3754 987.9762 988.8070 990.4041 1006.7100 1020.9449 1024.8888 1079.2057 1082.6851 1171.0748 1172.5335 1176.6435 1178.8454 1181.5083 1190.0451 1193.8727 1208.7861 1222.2945 1251.3757 1309.6632 1329.6080 1340.7913 1363.6087 1378.4706 1382.1788 1396.7354 1437.4579 1439.5261 1447.4202 1453.2120 1470.5957 1483.7324 1573.7134 1585.1414 1591.0186 1609.9593 1617.8837 1698.1308 2940.6451 2942.7545 2955.6545 2971.5785 2984.3020 3097.8607 3115.5143 3117.3030 3129.4398 3130.2666 3130.8438 3143.1773 3154.1875 3157.3707 3167.9858
redmass: 3.8091 4.7521 4.0717 2.3276 3.7913 4.0400 4.4763 4.0372 3.8546 2.7369 4.5157 4.4635 2.0750 2.8318 5.3976 4.7820 3.9225 3.2879 5.6823 5.9651 3.6620 6.4596 5.4858 1.2064 2.0094 3.6054 2.4135 5.3152 1.6429 1.6911 5.0012 3.7122 1.2534 1.4566 3.0430 1.4124 1.7732 1.5355 1.4758 2.8380 1.5565 1.9506 2.7911 1.5597 1.3525 2.2261 2.3342 1.7881 1.7769 1.1302 1.1672 1.1061 1.1506 1.3559 1.4481 1.1096 2.9837 1.6289 2.1590 1.4942 1.8710 1.9988 1.9512 4.0567 1.6891 3.8613 1.4550 1.9564 1.7382 1.3478 2.2365 2.5508 6.7202 6.2226 6.2882 6.1725 6.7474 6.6202 1.0601 1.0859 1.0624 1.0975 1.0949 1.0837 1.0867 1.0875 1.0868 1.0991 1.0903 1.0919 1.0992 1.0958 1.1006
irintensity: 0.2474 0.5280 0.4590 0.5553 0.0963 3.6500 0.9477 2.7646 13.2315 7.8121 2.4200 0.6392 0.0662 0.0509 3.4085 7.3879 10.9058 2.8946 11.1958 4.0845 0.5603 0.0349 2.8100 31.6458 34.2627 24.3091 35.1714 2.3595 23.5674 81.8106 1.9402 17.7173 0.1935 0.2548 3.9530 1.7364 3.9819 0.2558 1.6736 18.5239 15.8537 1.5150 1.7041 1.1434 2.4443 6.0962 2.7713 14.2826 2.3342 5.4542 0.6489 3.6662 4.3219 2.8755 0.6240 0.5415 18.8553 2.4126 2.3670 15.9607 1.7243 0.9837 2.5246 0.6572 0.0230 2.9018 6.9325 5.1066 2.2845 38.9335 14.4823 11.7018 76.6386 1.4582 17.3889 3.5782 25.1147 7.5253 42.4382 48.9631 19.0112 21.5054 13.5337 7.8922 4.1429 7.7630 0.2987 73.8110 25.5851 21.4997 29.8761 26.0933 29.3342
temp: 298.150 k
press: 1.00000 atm
elementType: 7 6 6 6 6 6 6 6 6 6 6 6 6 6 6 6 6 6 1 1 1 1 1 1 1 1 1 1 1 1 1 1 1
symmnumber: 1
zpe: 699849.2 jmol-1
zpe.correction: 0.266558 hartree
zpe.thermalcorrener: 0.281278 hartree
zpe.thermalcorrenthalpy: 0.282222 hartree
zpe.thermalcorrgfe: 0.223235 hartree
zpe.sumelectzpe: -710.298187 hartree
zpe.sumelectthermal: -710.283467 hartree
zpe.sumelectthermalent: -710.282523 hartree
zpe.sumelectthermalfe: -710.341510 hartree
dipole: -0.9396 0.6356 0.6676
dipole: 1.3163
quadrupole: -85.3459 -96.0935 -109.6082
quadrupole: 0.9168 -0.9768 3.3541
quadrupole: 11.6700 0.9223 -12.5923 0.9168 -0.9768 3.3541
hfenergy: -710.5647455 hartree
pointgroup: C01 [X(C17H15N1)]
dipole: -0.3569941 -0.1680041 -0.3354166 debye
polarizability: 349.0106295|-15.4447805|164.3201797|0.8762912|36.5347098|112.887755 unknown
InChI: InChI=1S/C17H15N/c1-2-7-14(8-3-1)13-18-17-12-6-10-15-9-4-5-11-16(15)17/h1-8,10,12-13H,9,11H2
charge 0 multiplicity 1
33 atoms
N  -0.403558 -0.200421 0.11164
C  1.987102 0.291162 0.039266
C  3.326672 -0.141928 -0.122966
C  1.634999 1.735069 0.364379
C  4.504927 0.816416 0.026009
C  0.92361 -0.655782 -0.116943
C  2.83333 2.634951 0.559689
C  4.11755 2.227438 0.407302
C  3.594183 -1.503916 -0.421779
C  1.210057 -2.017778 -0.407443
C  2.54729 -2.43771 -0.557798
C  -1.413665 -0.644359 -0.594284
C  -2.807337 -0.262919 -0.304837
C  -3.852746 -0.754726 -1.133698
C  -3.131828 0.587043 0.790402
C  -5.195738 -0.405641 -0.87673
C  -4.472177 0.93445 1.044822
C  -5.508949 0.439896 0.21308
H  0.986356 2.150447 -0.435529
H  0.985729 1.74886 1.264526
H  5.211511 0.410343 0.781318
H  5.083899 0.836596 -0.922807
H  2.624563 3.677361 0.836279
H  4.938555 2.940767 0.560749
H  4.635275 -1.831254 -0.534403
H  0.390758 -2.743426 -0.465646
H  2.771505 -3.489606 -0.766707
H  -1.267828 -1.319762 -1.465227
H  -3.607363 -1.410409 -1.97903
H  -2.314637 0.954561 1.419508
H  -5.994747 -0.789072 -1.520718
H  -4.716877 1.588757 1.889041
H  -6.551219 0.71179 0.41454
