program: Gaussian 09
title: 000228036
version: EM64L-G09RevD.01
frameworkgroup: C1[X(C12H23NO6)]
method: RPBEPBE
basis: SDD
operation: Freq
keyword: #p
keyword: freq=noraman
keyword: PBEPBE/SDD
title: #p freq=noraman PBEPBE/SDD
converged: NO YES NO NO
title: Mulliken charges:
elementType: O O O O O O N C C C C C C C C C C C C H H H H H H H H H H H H H H H H H H H H H H H
charge: -0.266454 -0.480077 -0.468296 -0.389130 -0.445433 -0.262080 -0.423475 -0.145862 -0.208545 -0.117722 -0.047636 -0.108099 -0.359099 0.237048 -0.545472 -0.362479 -0.336257 -0.356464 -0.692451 0.288533 0.273411 0.245782 0.243217 0.244068 0.322729 0.235082 0.175632 0.370755 0.372285 0.237571 0.211140 0.354354 0.237513 0.196725 0.187957 0.185379 0.360727 0.200318 0.195844 0.210779 0.218855 0.209328
chargesum: 0.00000
title: Mulliken charges with hydrogens summed into heavy atoms:
elementType: O O O O O O N C C C C C C C C C C C C
charge: -0.266454 -0.109322 -0.096011 -0.034777 -0.084705 -0.262080 -0.100746 0.142671 0.064865 0.128060 0.195581 0.135969 0.051614 0.237048 -0.096762 0.071760 0.037078 0.039698 -0.053488
polarizability: 1.90005938e+02 5.60930340e+00 1.43294192e+02 1.23249932e+00 -3.22634820e+00 1.39734483e+02
1716.lowfreq: -6.6029 -4.1236 -0.0009 -0.0009 -0.0006 1.9569 13.9343 34.8002 36.5320
frequency: 13.8108 34.2057 36.5007 47.4658 57.9857 90.6736 100.5481 111.0807 114.0665 127.1330 144.9948 172.0420 187.4888 211.0866 232.0072 236.9005 252.1498 259.7774 270.7424 310.0290 326.3862 346.7044 367.3738 381.9404 399.5519 403.3104 427.6048 443.1573 482.8494 492.7017 560.2831 606.5908 623.3560 644.4779 649.5992 684.5568 704.8550 728.1233 747.7330 757.3117 806.0404 830.5971 844.9774 888.7166 913.6886 944.0135 953.3865 962.1114 968.7953 986.1915 1003.3417 1006.3332 1020.5817 1046.1111 1060.3138 1067.2467 1076.7037 1084.2185 1091.8069 1111.7425 1122.6509 1129.4163 1158.1553 1181.7681 1186.9649 1207.7242 1234.2323 1236.9846 1241.7754 1261.0228 1271.2450 1277.5079 1286.7600 1290.9526 1292.5130 1298.4787 1317.1708 1323.4326 1333.0791 1345.1083 1346.4484 1353.4600 1354.3205 1380.4967 1386.1659 1390.2411 1397.5405 1410.2482 1449.6568 1451.7098 1465.5247 1470.6456 1478.5453 1481.2171 1481.6423 1488.8929 1611.5320 2942.1840 2953.0167 2969.3684 2973.0253 2973.7528 2982.2214 2982.5727 2995.6388 3012.3361 3022.3557 3028.3723 3045.3374 3045.8092 3055.4773 3059.6432 3070.2915 3073.8901 3085.9094 3412.9276 3471.6473 3509.6100 3517.4147 3602.7093
redmass: 4.8169 5.4991 2.2226 2.9293 5.7823 4.1014 2.7572 3.6881 3.4627 2.1734 4.5670 5.1014 4.8916 4.1936 4.8361 1.1112 4.9323 4.0323 3.5928 4.5802 1.1901 4.4028 4.0258 2.8017 3.8929 2.7651 3.4544 2.1820 2.7779 1.1656 4.9413 3.4489 2.8389 1.6589 1.7821 1.5528 4.4514 1.0740 3.7770 1.2254 2.7024 2.4147 1.6298 2.2258 2.5226 2.7669 1.5494 2.4041 8.0445 4.0957 4.2615 3.8367 3.5298 2.8948 3.0209 2.2057 2.2586 1.7020 1.7872 2.2836 2.3978 2.9862 1.1081 1.4496 1.5897 1.4978 1.4415 1.3450 1.3453 1.3004 1.5017 1.2104 1.0722 1.3496 1.1641 1.3633 1.3489 1.2377 1.3184 1.3320 1.4535 1.5288 1.4640 1.3148 1.3412 1.2143 1.4248 1.1888 1.1047 1.9856 1.0673 1.0727 1.0452 1.0682 1.0928 1.0893 7.0104 1.0702 1.0588 1.0589 1.0535 1.0426 1.0824 1.0658 1.0948 1.0865 1.0988 1.1025 1.0862 1.0854 1.0876 1.1029 1.1008 1.0993 1.0939 1.0663 1.0645 1.0769 1.0651 1.0669
irintensity: 0.2945 3.2910 1.0476 1.3813 4.9107 3.2822 0.3842 5.0647 1.9746 1.1777 2.1181 8.0939 2.9170 10.1268 4.5478 0.0124 9.0217 8.0264 6.9008 1.8602 112.2940 6.9656 1.6952 32.1887 3.1454 53.2072 6.7697 42.0852 25.5186 193.4022 7.3623 25.7271 59.5660 93.7634 15.5354 72.2270 21.5379 10.7136 15.5689 0.9999 31.3468 16.1203 22.5956 14.4491 65.6765 12.8347 5.4383 22.8457 109.3511 5.1987 234.0752 2.0936 79.5763 43.9794 32.1258 41.3856 4.8468 20.6007 15.6033 10.3565 6.2230 17.1512 19.4274 25.3840 7.1455 7.4789 34.1635 19.7415 19.5883 7.5945 29.1655 9.0159 2.5830 21.1540 1.9739 49.7914 41.6443 30.2761 14.1986 17.9192 11.7664 1.3297 14.0058 23.9852 32.1054 10.8644 12.7137 96.7533 10.7887 352.0690 0.0216 0.8982 11.7755 6.3739 4.2774 22.5814 141.5902 53.0851 13.2587 44.1293 16.6227 23.2368 31.0045 57.7859 8.5306 19.9318 23.1434 2.1381 20.4147 7.8181 34.1541 32.6552 103.6588 50.1820 28.8308 91.6991 33.1085 29.3506 21.8773 24.9815
temp: 298.150 k
press: 1.00000 atm
elementType: 8 8 8 8 8 8 7 6 6 6 6 6 6 6 6 6 6 6 6 1 1 1 1 1 1 1 1 1 1 1 1 1 1 1 1 1 1 1 1 1 1 1
symmnumber: 1
zpe: 924933.6 jmol-1
zpe.correction: 0.352289 hartree
zpe.thermalcorrener: 0.373802 hartree
zpe.thermalcorrenthalpy: 0.374746 hartree
zpe.thermalcorrgfe: 0.299935 hartree
zpe.sumelectzpe: -975.612005 hartree
zpe.sumelectthermal: -975.590491 hartree
zpe.sumelectthermalent: -975.589547 hartree
zpe.sumelectthermalfe: -975.664358 hartree
dipole: -3.6143 -0.4515 1.3301
dipole: 3.8777
quadrupole: -130.0277 -131.5068 -113.4923
quadrupole: -13.3800 17.7512 -1.0558
quadrupole: -5.0187 -6.4979 11.5166 -13.3800 17.7512 -1.0558
hfenergy: -975.9642935 hartree
pointgroup: C01 [X(C12H23N1O6)]
dipole: 1.4401123 -0.4940507 -0.0971954 debye
polarizability: 189.8821289|-0.3509603|143.4969921|6.3542983|-2.8919193|139.6554922 unknown
InChI: InChI=1S/C12H23NO6/c1-2-3-4-5-8(15)13-9-11(17)10(16)7(6-14)19-12(9)18/h7,9-14,16-18H,2-6H2,1H3
charge 0 multiplicity 1
42 atoms
O  -2.43124 0.961014 1.038413
O  -2.665133 -2.277893 -0.520364
O  -2.79807 -0.413249 -2.461123
O  -1.734822 -0.051994 3.068693
O  -4.419045 1.85507 -2.005843
O  1.633401 -1.985938 0.927757
N  0.168528 -0.185982 0.890259
C  -1.033312 -1.035851 0.90355
C  -1.540988 -1.314939 -0.537989
C  -2.132113 -0.050709 -1.198157
C  -3.117129 0.690708 -0.251252
C  -2.130036 -0.326514 1.73076
C  -3.569941 2.042228 -0.829338
C  1.452576 -0.731209 0.895583
C  2.6009 0.277588 0.885728
C  3.705178 -0.099858 -0.131455
C  4.94343 0.816621 -0.026495
C  6.043285 0.459225 -1.052417
C  7.284517 1.370894 -0.943319
H  -0.744776 -1.991719 1.377376
H  -0.707544 -1.711356 -1.149757
H  -1.313771 0.635211 -1.480738
H  -4.007345 0.049654 -0.075872
H  -3.049611 -0.93486 1.789602
H  0.026256 0.818711 0.747218
H  -4.181964 2.575051 -0.083976
H  -2.677261 2.663839 -1.063666
H  -2.320062 -3.197654 -0.412425
H  -3.273029 -1.2715 -2.281306
H  3.044426 0.282631 1.902043
H  2.229633 1.303429 0.692607
H  -0.808178 0.306553 3.068203
H  3.9934 -1.153148 0.044294
H  3.293505 -0.051302 -1.159931
H  5.365298 0.749857 0.998396
H  4.640805 1.875321 -0.170765
H  -3.986032 1.160596 -2.579497
H  6.344711 -0.59811 -0.90843
H  5.622045 0.525861 -2.076218
H  7.744274 1.296813 0.060319
H  8.054025 1.096636 -1.687859
H  7.014702 2.430776 -1.110909
