program: Gaussian 09
title: 000228023
version: EM64L-G09RevD.01
frameworkgroup: C1[X(C8H12N6)]
method: RPBEPBE
basis: SDD
operation: Freq
keyword: #pfreq=noraman
keyword: PBEPBE/SDD
title: #p freq=noraman PBEPBE/SDD
converged: YES YES NO NO
title: Mulliken charges:
elementType: N N N N N N C C C C C C C C H H H H H H H H H H H H
charge: -0.137232 -0.137241 -0.625912 -0.639703 -0.625912 -0.639698 0.204532 0.204530 -0.375411 -0.364493 -0.364482 -0.375407 0.178802 0.178808 0.241426 0.248022 0.248015 0.241426 0.327288 0.294313 0.305070 0.343292 0.327290 0.294315 0.305067 0.343296
chargesum: 0.00000
title: Mulliken charges with hydrogens summed into heavy atoms:
elementType: N N N N N N C C C C C C C C
charge: -0.137232 -0.137241 -0.004311 0.008658 -0.004307 0.008665 0.204532 0.204530 -0.133985 -0.116472 -0.116467 -0.133981 0.178802 0.178808
polarizability: 2.65852185e+02 -3.15882906e+00 1.09038474e+02 -8.52253378e-05 3.97429212e-06 8.31100491e+01
1716.lowfreq: -4.7792 -3.9795 0.0006 0.0008 0.0009 11.8188 35.4569 61.0205 68.8494
frequency: 35.4563 61.0067 68.8131 86.4898 124.8801 135.3791 205.2361 288.4264 303.4586 322.2676 329.5971 378.1518 402.0732 407.1697 410.3524 428.5039 436.0720 485.7755 496.3756 507.9974 527.5319 533.5843 555.7541 556.6570 622.2853 639.9508 655.4670 678.7875 715.3804 757.2580 799.7753 828.0696 845.6218 940.3744 941.6462 945.3073 959.2662 995.6546 1029.8359 1030.0529 1082.9590 1091.0880 1100.6971 1171.4046 1271.6630 1284.6369 1295.0647 1324.0265 1412.3101 1425.1467 1428.6780 1489.7910 1537.5746 1599.0532 1599.8269 1608.2621 1610.1945 1617.3035 1654.7859 1674.0682 3119.3148 3119.3446 3149.6649 3154.4866 3529.0068 3529.0923 3537.5372 3537.6976 3677.3827 3677.6729 3680.5429 3680.5794
redmass: 4.9863 3.9689 4.1434 4.5723 4.5241 4.6844 5.4081 3.7160 1.1675 1.1326 3.8755 4.4547 1.4347 1.2630 2.8221 2.3771 2.3809 1.7877 1.2674 1.7711 2.1709 2.9217 1.2831 1.2448 4.2208 4.4454 4.9013 7.0135 4.6003 5.9388 4.4470 1.2447 1.9060 4.1614 2.8480 1.5279 1.3672 2.6885 1.4074 1.4085 1.9576 1.6904 1.3896 1.1120 2.4523 1.5049 3.2049 4.7629 4.3468 4.1803 3.9822 2.7566 6.9721 1.2793 1.3064 1.9548 1.4081 2.3832 2.7648 3.5269 1.0877 1.0878 1.0948 1.0960 1.0448 1.0449 1.0448 1.0449 1.1037 1.1037 1.1027 1.1027
irintensity: 4.1380 0.0046 1.6175 5.3055 4.6941 4.4393 8.3151 2.6795 223.2867 77.5690 9.2887 40.5027 127.7343 222.4019 20.5393 28.5067 58.1388 57.8122 106.6067 61.3943 14.6889 56.3092 218.1954 231.4577 9.6832 37.6460 102.5524 13.5760 12.8641 29.0920 6.1341 1.3466 49.6596 7.3172 45.1272 12.9413 0.2666 0.0360 7.7193 3.4283 1.3405 24.8448 21.3348 0.8574 45.1807 0.1081 9.8450 21.2392 87.9882 103.1723 201.2316 163.6634 2.7209 70.4323 121.9651 0.3000 485.6282 38.6723 1776.0062 184.6288 34.2234 0.2868 29.5223 0.4914 66.0239 9.0419 12.9086 11.1049 64.2961 0.7185 10.0152 39.8115
temp: 298.150 k
press: 1.00000 atm
elementType: 7 7 7 7 7 7 6 6 6 6 6 6 6 6 1 1 1 1 1 1 1 1 1 1 1 1
symmnumber: 1
zpe: 545153.8 jmol-1
zpe.correction: 0.207638 hartree
zpe.thermalcorrener: 0.221930 hartree
zpe.thermalcorrenthalpy: 0.222874 hartree
zpe.thermalcorrgfe: 0.166555 hartree
zpe.sumelectzpe: -639.539364 hartree
zpe.sumelectthermal: -639.525073 hartree
zpe.sumelectthermalent: -639.524129 hartree
zpe.sumelectthermalfe: -639.580448 hartree
dipole: -0.0001 -0.0002 4.6122
dipole: 4.6122
quadrupole: -38.1198 -78.2704 -83.0316
quadrupole: -7.2912 0.0001 0.0001
quadrupole: 28.3542 -11.7965 -16.5577 -7.2912 0.0001 0.0001
hfenergy: -639.7470026 hartree
pointgroup: C01 [X(C8H12N6)]
dipole: -0.0027895 -1.8145884 0.0007866 debye
dipolederiv: -2.2031384 -0.1743983 0.0520907 -0.2928348 -0.520539 0.160653 0.2847486 0.2176951 -0.4837264 -2.2017015 0.179557 0.051439 0.2982519 -0.5223497 -0.1607733 0.2838322 -0.2185262 -0.4833696 -1.7209929 0.1929893 0.020374 0.3673794 -0.3375996 -0.119879 0.1870456 -0.1311692 -0.6228105 -0.5466404 -0.0501738 -0.1315713 -0.4627438 -1.1096813 0.2462658 0.1446939 0.1847861 -0.6033471 -1.7227275 -0.1887292 0.0209128 -0.362952 -0.3356731 0.1195768 0.1877565 0.1303514 -0.6230433 -0.5450742 0.0482847 -0.1323588 0.4611242 -1.1116418 -0.2453946 0.1436847 -0.1847308 -0.6029168 1.4942859 0.115074 0.0688885 -0.0432897 0.0031783 0.0112546 0.1269672 0.0316759 -0.0407963 1.4940607 -0.1195407 0.0689511 0.0388705 0.0033689 -0.0115059 0.1268259 -0.0321053 -0.040754 -0.2657067 -0.0302112 -0.1220696 0.0169411 -0.1519937 -0.0026752 0.238671 -0.0213948 0.1224911 -0.1967518 0.036054 0.0876329 0.0536182 -0.2010244 -0.0366065 -0.3046088 -0.030164 0.0369114 -0.1970125 -0.035971 0.0877733 -0.0539127 -0.2006828 0.0365483 -0.3044576 0.0313037 0.0368551 -0.2656817 0.0304417 -0.122082 -0.0163591 -0.1520127 0.0033099 0.2387547 0.0209336 0.1224659 2.5460917 0.0525831 -0.0177063 0.5336478 1.0264511 -0.5523421 -0.5709858 -0.6856247 0.6540653 2.54429 -0.0572065 -0.0159579 -0.5388334 1.0293883 0.5520231 -0.5683782 0.6869838 0.652898 0.0569895 0.0183618 -0.0747335 0.0047028 0.1532174 0.0075332 -0.0749403 0.0110926 -0.0744111 -0.0310329 -0.0226938 0.1099849 -0.0185739 0.1464468 0.0070689 0.1047181 0.0089203 -0.0231327 -0.0309061 0.0233314 0.1099434 0.0192063 0.1463049 -0.007555 0.1046714 -0.0093938 -0.0231168 0.05692 -0.0181401 -0.0747385 -0.0044801 0.1532694 -0.0075232 -0.0749682 -0.0110794 -0.0743929 0.2885317 -0.0498916 0.0004113 -0.0754533 0.233376 0.086251 -0.0531472 0.1119315 0.2728067 0.1984868 -0.0429628 -0.033137 -0.1610813 0.1279644 0.0613027 -0.227871 0.0501961 0.3311761 0.1935161 0.0428696 0.0493244 0.0749329 0.3056313 0.0545824 0.1534715 0.1591894 0.2148402 0.1867584 0.0443843 -0.0096212 0.1287752 0.3241495 0.0296158 -0.008842 0.0801424 0.2159552 0.2889128 0.0497227 0.0001034 0.0752326 0.2328165 -0.086216 -0.0535512 -0.1117307 0.2729937 0.1991155 0.0427127 -0.033359 0.160645 0.1272503 -0.0610271 -0.2281521 -0.0493237 0.3312821 0.1931505 -0.0424706 0.0491937 -0.0744479 0.305802 -0.0548154 0.153043 -0.1597431 0.2150322 0.1862572 -0.0439764 -0.0096883 -0.1283659 0.3245831 -0.029672 -0.0089818 -0.0802162 0.2160448 unknown
polarizability: 265.7570528|-0.2797923|83.1104835|-4.9819525|0.0198418|109.1331719 unknown
InChI: InChI=1S/C8H12N6/c9-7(10)13-5-1-2-6(4-3-5)14-8(11)12/h1-4H,9-12H2
charge 0 multiplicity 1
26 atoms
N  -2.796968 0.315464 -0.601557
N  2.79902 0.307548 0.601271
N  -5.065388 -0.104015 -0.209377
N  -3.498376 -1.517878 0.828227
N  5.06613 -0.119272 0.209466
N  3.494745 -1.529262 -0.826817
C  -1.4189 0.244569 -0.268671
C  1.420735 0.240525 0.268466
C  -0.467266 0.268217 -1.32696
C  0.917691 0.258957 -1.070071
C  -0.9158 0.262726 1.069848
C  0.469179 0.268033 1.326731
C  -3.716836 -0.410061 -0.00147
C  3.716646 -0.421356 0.00184
H  -0.844608 0.31176 -2.35434
H  1.621601 0.318321 -1.909427
H  -1.619533 0.324987 1.909142
H  0.84665 0.311402 2.354071
H  -5.237567 0.706318 -0.80172
H  -5.768505 -0.840397 -0.182749
H  -4.209005 -1.827195 1.487192
H  -2.536332 -1.811227 0.986133
H  5.240805 0.691066 0.80107
H  5.766999 -0.857817 0.183465
H  4.204399 -1.841393 -1.485504
H  2.531782 -1.819721 -0.984461
