program: Gaussian 09
title: 000228018
version: EM64L-G09RevD.01
frameworkgroup: C1[X(C15H23NO)]
method: RPBEPBE
basis: SDD
operation: Freq
keyword: #p
keyword: freq=noraman
keyword: PBEPBE/SDD
title: #p freq=noraman PBEPBE/SDD
converged: YES YES NO NO
title: Mulliken charges:
elementType: O N C C C C C C C C C C C C C C C H H H H H H H H H H H H H H H H H H H H H H H
charge: -0.276293 -0.141923 -0.416496 -0.449273 -0.012324 -0.002456 -0.692839 -0.707249 -0.689986 -0.713605 0.105567 0.326697 -0.387166 -0.369284 -0.234513 -0.235816 -0.233024 0.221624 0.257577 0.225740 0.245432 0.191979 0.192538 0.204062 0.240532 0.212842 0.212627 0.202572 0.217277 0.209910 0.224761 0.224457 0.228117 0.203717 0.216588 0.249095 0.260218 0.228439 0.229664 0.230220
chargesum: 0.00000
title: Mulliken charges with hydrogens summed into heavy atoms:
elementType: O N C C C C C C C C C C C C C C C
charge: -0.276293 -0.141923 0.062705 0.021899 0.179654 0.190082 -0.035403 -0.074773 -0.030859 -0.065184 0.105567 0.326697 -0.138071 -0.109066 -0.006074 -0.006153 -0.002805
polarizability: 2.10359820e+02 -1.14497291e+00 1.44417780e+02 -1.00119795e+00 7.88843137e+00 1.52645537e+02
1716.lowfreq: -8.9342 -7.9368 -0.0007 -0.0001 0.0004 5.6177 34.4869 40.1775 50.1605
frequency: 34.3553 40.1407 50.1184 57.8366 87.6363 90.1362 108.9672 137.1372 173.3525 204.0840 232.9933 239.1730 252.0246 259.8882 268.4887 288.4029 323.0066 331.9860 357.4781 368.3470 378.7197 403.3639 406.6694 434.9750 487.8398 563.4828 609.7664 615.3957 639.8307 694.2119 707.3544 719.5456 769.2828 775.8733 788.5856 858.3220 861.9127 882.1263 911.6755 921.1805 932.2549 939.3531 956.6776 962.3249 965.9123 972.6394 980.7637 989.7944 997.8415 1024.6980 1063.3593 1079.5340 1087.2816 1107.3561 1115.6383 1172.2523 1174.7354 1181.8526 1186.2924 1194.7477 1204.0177 1257.1133 1275.9508 1302.3087 1305.5238 1314.5317 1319.6959 1340.0159 1355.2768 1372.0109 1377.6735 1378.1292 1380.0772 1395.3503 1399.4149 1400.9927 1431.1726 1449.4236 1459.2376 1465.1999 1467.5824 1476.3078 1478.3032 1479.0823 1479.9169 1486.9412 1491.0546 1494.0035 1546.0047 1587.7388 1608.6890 2948.7569 2955.4172 2966.0490 2971.2985 2977.8822 2979.6656 3012.4436 3018.6017 3059.8999 3063.2590 3064.2572 3068.8529 3070.2972 3073.9593 3080.0349 3082.3903 3086.1884 3092.5720 3120.5226 3129.8870 3141.7310 3153.3954 3166.4121
redmass: 3.6736 3.0627 3.5239 3.3037 2.9499 3.9254 5.6329 3.0152 3.6198 4.1240 1.2873 2.0788 1.1486 2.6629 1.0588 1.1805 3.0435 4.0531 2.4164 2.1003 2.2509 2.6825 3.0220 1.6855 3.1240 3.7380 4.3059 5.2677 3.7328 4.3171 1.6301 4.7210 3.2094 3.2184 2.4186 1.2697 2.2214 1.5631 1.3042 1.2187 1.4121 1.5692 2.0092 1.5445 1.7695 2.2154 1.4007 5.7476 1.3382 2.3129 1.7748 1.6335 1.8597 1.8020 1.7963 1.0747 2.2677 2.0420 1.1200 2.1219 2.2788 1.5865 1.4414 1.4982 1.4494 1.3398 1.6562 1.4938 1.2453 1.2827 1.3829 3.5592 1.3086 1.4640 1.2230 1.5423 2.2228 1.1259 1.0756 1.1034 1.0481 1.0593 1.1009 1.0735 2.0253 1.0539 1.0573 1.0585 5.9471 6.1459 6.0687 1.0822 1.0820 1.0360 1.0359 1.0359 1.0363 1.0623 1.0609 1.0996 1.0994 1.0993 1.0997 1.0986 1.0997 1.1002 1.1003 1.1020 1.0996 1.0860 1.0873 1.0922 1.0959 1.1013
irintensity: 0.3230 0.2719 0.7070 0.6933 0.5512 1.4735 1.7304 2.3755 0.0124 0.5608 0.1458 0.3823 0.0899 3.7171 0.2853 2.4102 2.3418 1.7257 1.7624 0.2971 3.1622 3.0077 3.3158 4.9977 1.1212 2.0907 7.3508 4.3826 15.0336 3.6813 62.7754 22.7076 2.0704 2.6484 35.8854 0.5351 7.5545 9.2283 7.5673 0.1158 5.8288 2.9629 8.4968 0.8111 4.0334 6.0160 2.0776 0.2356 0.1774 13.5605 36.5635 26.2984 21.3094 14.7425 3.6149 0.3204 5.9393 3.3085 3.1071 1.5131 10.3662 84.7430 36.6539 10.9297 8.0023 2.6079 22.3560 4.5195 6.6213 7.8450 14.6874 6.3983 4.1920 52.5316 23.7038 73.0897 8.1576 23.3847 12.2988 4.3115 0.4867 1.3360 39.9353 1.0521 4.2794 18.3088 27.9220 14.8520 178.2532 6.7755 1.2654 27.6177 30.9749 27.5288 32.4652 16.8160 26.3727 36.3890 38.7134 38.2291 26.1101 3.5529 29.0910 127.9371 86.4692 13.4859 20.6524 24.0412 21.8600 5.0809 1.6823 21.0373 24.7435 20.8995
temp: 298.150 k
press: 1.00000 atm
elementType: 8 7 6 6 6 6 6 6 6 6 6 6 6 6 6 6 6 1 1 1 1 1 1 1 1 1 1 1 1 1 1 1 1 1 1 1 1 1 1 1
symmnumber: 1
zpe: 912053.8 jmol-1
zpe.correction: 0.347383 hartree
zpe.thermalcorrener: 0.365794 hartree
zpe.thermalcorrenthalpy: 0.366738 hartree
zpe.thermalcorrgfe: 0.300676 hartree
zpe.sumelectzpe: -714.061744 hartree
zpe.sumelectthermal: -714.043333 hartree
zpe.sumelectthermalent: -714.042389 hartree
zpe.sumelectthermalfe: -714.108451 hartree
dipole: -0.4694 1.8747 -3.3284
dipole: 3.8488
quadrupole: -92.7907 -105.0927 -108.3109
quadrupole: 0.2996 -0.6439 5.3159
quadrupole: 9.2741 -3.0280 -6.2461 0.2996 -0.6439 5.3159
hfenergy: -714.4091265 hartree
pointgroup: C01 [X(C15H23N1O1)]
dipole: 0.3216896 -0.6976775 -1.3048526 debye
polarizability: 208.6432265|10.5191869|146.0456266|2.7294198|-7.4900567|152.7342847 unknown
InChI: InChI=1S/C15H23NO/c1-12(2)10-16(11-13(3)4)15(17)14-8-6-5-7-9-14/h5-9,12-13H,10-11H2,1-4H3
charge 0 multiplicity 1
40 atoms
O  -0.011112 0.806053 2.024321
N  1.062456 0.075285 0.079758
C  2.354715 0.60561 0.59753
C  1.10169 -0.896455 -1.045669
C  2.725973 2.022666 0.066811
C  1.34529 -2.392721 -0.663863
C  1.703168 3.103548 0.486381
C  2.951709 2.043033 -1.464109
C  0.229373 -2.959719 0.243445
C  2.738642 -2.677353 -0.054646
C  -0.083115 0.3332 0.840959
C  -1.44412 0.120245 0.216367
C  -1.766687 0.630206 -1.068068
C  -2.466058 -0.468776 1.002322
C  -3.084325 0.527771 -1.567154
C  -3.77786 -0.587928 0.496949
C  -4.090994 -0.092508 -0.791551
H  3.155634 -0.099196 0.318609
H  2.28482 0.639892 1.699631
H  1.895979 -0.572424 -1.742812
H  0.145076 -0.848148 -1.590947
H  3.695464 2.261066 0.556774
H  1.294604 -2.927291 -1.638366
H  2.058159 4.108091 0.188838
H  1.530059 3.094996 1.576114
H  0.726187 2.933499 -0.003214
H  2.009345 1.828191 -2.002813
H  3.70898 1.299145 -1.778603
H  3.300613 3.039652 -1.792309
H  0.383837 -4.041505 0.412608
H  -0.771889 -2.820872 -0.202337
H  0.233634 -2.463823 1.231885
H  2.828176 -2.249323 0.960402
H  3.554182 -2.266831 -0.680178
H  2.899481 -3.767999 0.033218
H  -0.996042 1.136364 -1.661809
H  -2.220905 -0.813004 2.012619
H  -3.326091 0.937476 -2.554278
H  -4.557487 -1.054856 1.109009
H  -5.11186 -0.176956 -1.180723
