program: Gaussian 09
title: 000228016
version: EM64L-G09RevD.01
frameworkgroup: C1[X(C15H14O)]
method: RPBEPBE
basis: SDD
operation: Freq
keyword: #pfreq=noraman
keyword: PBEPBE/SDD
title: #p freq=noraman PBEPBE/SDD
converged: NO YES NO NO
title: Mulliken charges:
elementType: O C C C C C C C C C C C C C C C H H H H H H H H H H H H H H
charge: -0.226170 -0.679147 0.314012 0.502494 0.118206 0.444668 -0.337981 -0.358782 -0.431186 -0.359551 -0.384977 -0.439217 -0.217999 -0.225410 -0.805026 -0.246761 0.258732 0.222296 0.241807 0.276188 0.233498 0.233922 0.258230 0.228739 0.226741 0.225739 0.233266 0.227109 0.237640 0.228920
chargesum: 0.00000
title: Mulliken charges with hydrogens summed into heavy atoms:
elementType: O C C C C C C C C C C C C C C C
charge: -0.226170 -0.198120 0.314012 0.502494 0.118206 0.444668 -0.096174 -0.082594 -0.197687 -0.125630 -0.126746 -0.210478 0.008741 0.000329 -0.107011 -0.017841
polarizability: 1.93041791e+02 1.23370315e+00 1.64949546e+02 -2.11228503e+00 1.46693038e+01 1.22690152e+02
1716.lowfreq: -17.4450 -9.6350 -6.5675 -0.0004 -0.0001 0.0007 17.4119 29.7251 39.4577
frequency: 16.1535 29.6563 39.3581 47.7763 92.9569 103.0443 156.5381 213.9264 264.5684 300.4689 337.9178 348.6656 402.7765 404.4428 449.5610 458.3498 470.6982 529.6096 566.7487 616.0341 633.4378 657.3762 693.2066 708.2454 732.8687 759.2647 801.3961 807.0169 845.4806 855.1486 861.9241 916.5737 932.4810 961.5114 978.6967 986.6310 989.7422 996.5096 999.9805 1009.1735 1026.7944 1036.0442 1047.3452 1081.3908 1123.8151 1151.1829 1172.2598 1188.9752 1194.6788 1199.1471 1225.0123 1270.3949 1284.9604 1310.2404 1331.1865 1372.5407 1380.8947 1397.4910 1411.5468 1439.3396 1457.5104 1468.9715 1472.3704 1482.6610 1502.5179 1555.9952 1587.3216 1593.5495 1612.0269 1621.2594 2978.4239 3006.0225 3056.6575 3065.6841 3089.5847 3110.6468 3123.9156 3124.1885 3129.5024 3134.9131 3145.6608 3156.6189 3162.6772 3163.2285
redmass: 4.5927 3.4942 1.0956 3.7739 6.7460 4.0642 4.4804 4.2789 4.2025 4.2131 2.6132 3.9627 2.8101 2.8299 3.9176 3.2828 2.8956 3.7817 4.8980 6.3560 6.8856 4.4694 3.7725 1.7066 2.4063 2.3774 2.7971 2.8511 1.7896 1.2547 1.4469 1.5602 2.1059 1.3874 1.3837 1.5339 4.9776 1.3317 1.3638 3.1581 2.2461 2.6430 1.5845 1.6300 1.3089 1.2909 1.0538 1.1408 1.1299 2.6228 2.9891 1.6948 2.3848 1.2949 1.2918 4.3425 8.1755 1.2546 3.6819 2.1394 1.1408 1.0537 1.1098 2.1605 2.5924 6.9213 7.1205 6.1243 6.0598 6.4289 1.0377 1.0587 1.0969 1.1026 1.0989 1.0878 1.0861 1.0890 1.0888 1.0914 1.0960 1.0945 1.0954 1.1013
irintensity: 1.1085 0.2156 0.3103 0.2653 2.5110 0.3045 0.6517 4.3803 2.3625 1.7774 3.3109 0.4603 0.0766 0.0910 2.4535 1.6391 10.8730 17.9773 30.7434 0.8885 0.2778 5.0163 7.5125 75.4709 26.9482 12.6787 19.1957 19.2174 3.7721 1.0472 12.3809 4.8740 10.8612 1.5768 0.1722 0.9320 2.4343 0.2462 2.4804 15.3280 8.2543 19.9567 14.4670 7.8218 16.0447 41.7632 0.7987 11.2213 17.4755 2.4731 0.5291 77.6323 142.3311 6.9043 10.7537 1.7521 0.5470 16.0821 12.5110 6.8837 24.1704 13.9989 15.0934 21.2186 0.5251 137.1616 59.1871 13.0074 25.1990 41.2660 26.0680 16.3522 17.9135 10.7862 17.8449 12.0895 0.5491 14.5920 14.8860 13.7357 31.3507 15.3980 7.1226 21.7157
temp: 298.150 k
press: 1.00000 atm
elementType: 8 6 6 6 6 6 6 6 6 6 6 6 6 6 6 6 1 1 1 1 1 1 1 1 1 1 1 1 1 1
symmnumber: 1
zpe: 636551.3 jmol-1
zpe.correction: 0.242450 hartree
zpe.thermalcorrener: 0.256732 hartree
zpe.thermalcorrenthalpy: 0.257676 hartree
zpe.thermalcorrgfe: 0.198158 hartree
zpe.sumelectzpe: -654.102071 hartree
zpe.sumelectthermal: -654.087789 hartree
zpe.sumelectthermalent: -654.086845 hartree
zpe.sumelectthermalfe: -654.146362 hartree
dipole: -1.4079 -3.5007 -0.6382
dipole: 3.8268
quadrupole: -81.8965 -98.1078 -89.0049
quadrupole: -0.1288 -1.1125 1.9399
quadrupole: 7.7733 -8.4381 0.6648 -0.1288 -1.1125 1.9399
hfenergy: -654.3445207 hartree
pointgroup: C01 [X(C15H14O1)]
dipole: 0.6057369 0.4769116 1.293224 debye
polarizability: 192.9232463|-3.6070048|129.5541142|1.4617268|21.2863304|158.2041291 unknown
InChI: InChI=1S/C15H14O/c1-12-7-9-14(10-8-12)15(16)11-13-5-3-2-4-6-13/h2-10H,11H2,1H3
charge 0 multiplicity 1
30 atoms
O  -0.01997 -0.528882 -3.020566
C  -1.102378 1.157433 -1.653153
C  1.257979 0.145444 -1.093596
C  -2.004099 0.609149 -0.543078
C  0.060203 0.207809 -1.990597
C  3.599932 -0.045747 0.544109
C  1.377458 0.916571 0.092392
C  2.326697 -0.724497 -1.449271
C  2.532404 0.819269 0.896432
C  3.475299 -0.815773 -0.646035
C  -2.524705 -0.708003 -0.630321
C  -2.356697 1.410469 0.571825
C  -3.376814 -1.210968 0.377084
C  -3.2124 0.909625 1.579558
C  4.83852 -0.160044 1.412579
C  -3.724152 -0.404717 1.486396
H  -1.684918 1.2668 -2.585951
H  -0.726364 2.157663 -1.371644
H  0.56749 1.583718 0.402503
H  2.224188 -1.314679 -2.366159
H  2.607895 1.418956 1.811063
H  4.29052 -1.489612 -0.936726
H  -2.26042 -1.335111 -1.490014
H  -1.971551 2.435629 0.646952
H  -3.770988 -2.230345 0.296425
H  -3.479512 1.543599 2.432763
H  5.759561 -0.001025 0.821705
H  4.829154 0.575772 2.234231
H  4.915082 -1.167802 1.863733
H  -4.386415 -0.795199 2.267061
