program: Gaussian 09
title: 000228002
version: EM64L-G09RevD.01
frameworkgroup: C1[X(C20H21ClN2O2S)]
method: RPBEPBE
basis: SDD
operation: Freq
keyword: #p
keyword: freq=noraman
keyword: PBEPBE/SDD
title: #p freq=noraman PBEPBE/SDD
converged: YES YES NO NO
title: Mulliken charges:
elementType: Cl S O O N N C C C C C C C C C C C C C C C C C C C C H H H H H H H H H H H H H H H H H H H H H
charge: -0.042729 0.194080 -0.245178 -0.348152 -0.094951 -0.388282 -0.341155 -0.327419 -0.348235 -0.453759 -0.323081 -0.315388 0.309315 0.255096 -0.476094 0.459411 -0.406238 0.103861 0.424367 -0.449809 -0.297275 -0.827399 -0.333460 -0.291218 -0.240876 -0.100967 0.196436 0.234828 0.205336 0.194467 0.195359 0.211335 0.224892 0.235249 0.216088 0.192571 0.192165 0.215256 0.368044 0.246849 0.234020 0.231970 0.241008 0.240346 0.294850 0.272330 0.262132
chargesum: 0.00000
title: Mulliken charges with hydrogens summed into heavy atoms:
elementType: Cl S O O N N C C C C C C C C C C C C C C C C C C C C
charge: -0.042729 0.194080 -0.245178 -0.348152 -0.094951 -0.020238 0.090110 0.072384 0.058460 0.006381 0.085579 0.092033 0.309315 0.255096 -0.476094 0.459411 -0.159389 0.103861 0.424367 -0.215789 -0.297275 -0.114075 -0.038610 -0.018887 0.021256 -0.100967
polarizability: 4.46113645e+02 3.11251540e+01 2.98216176e+02 -2.58771029e+01 1.03340726e+01 1.41713475e+02
1716.lowfreq: -3.1865 -0.0027 -0.0021 -0.0010 3.8506 5.5728 13.6717 18.9121 34.5694
frequency: 13.5495 18.8081 34.1424 42.4892 60.9909 76.7239 102.0777 103.6220 118.2314 130.0936 151.4498 168.2915 177.2620 212.2429 233.1506 236.5386 245.3728 260.9358 274.6208 287.2019 315.7982 334.9048 349.8069 376.6219 382.7642 400.0382 408.4522 421.4084 432.4320 433.5714 442.7059 467.2681 483.9531 497.8806 503.8505 540.3828 582.5281 590.7606 601.3622 626.1900 663.1932 664.7411 712.0306 729.0292 762.0201 770.3276 782.1718 794.5486 810.2355 814.2826 838.5286 841.4670 844.9053 856.3490 865.4706 870.4957 899.7217 948.9793 956.1145 994.0251 997.5193 1018.1419 1026.4444 1030.3851 1044.4990 1053.1363 1055.6769 1066.8139 1083.9703 1084.6986 1094.0501 1111.7418 1129.2121 1133.8125 1146.4238 1162.0855 1178.2396 1191.2809 1221.7439 1241.0690 1249.9387 1255.6286 1271.4462 1283.4309 1292.3388 1295.2084 1311.7910 1324.7111 1332.9904 1346.7607 1351.2246 1362.5949 1369.6770 1372.0760 1374.0088 1388.7852 1395.1072 1402.7687 1409.4427 1442.8972 1446.9155 1451.1831 1453.4150 1458.2427 1467.0331 1470.5895 1474.4710 1491.2528 1500.3245 1538.1710 1563.5299 1588.3895 1593.1297 1620.1044 2864.3848 2866.9671 2881.0230 2954.6948 2958.3998 2965.5268 2996.2717 3025.2689 3028.6083 3036.4525 3036.8935 3062.9386 3081.1223 3084.3628 3085.4564 3126.6766 3158.4274 3160.4167 3161.8862 3171.2502 3180.2614
redmass: 5.1071 6.7352 3.7164 7.1952 5.1641 4.6207 3.7011 8.5546 4.8689 6.1955 1.1578 4.2941 4.8107 3.6225 3.7808 1.8446 3.7721 3.8362 6.1968 5.3520 2.3941 4.9471 4.9132 3.1710 4.6175 3.6178 3.6255 10.1457 3.5033 7.0668 5.8637 2.8037 4.4623 5.4010 6.4790 5.3664 4.1663 3.5808 3.5966 2.8930 6.1487 4.5666 4.5102 4.0916 7.1872 4.0284 2.8477 1.4458 3.5255 1.7148 2.4184 2.6746 1.6115 4.6644 1.4259 1.1309 2.3517 1.3442 2.9697 1.3425 2.9439 1.9097 2.4748 3.1031 1.4891 1.9768 3.1114 2.0405 3.3012 3.7483 3.2921 2.3325 1.8582 2.4276 2.0226 2.7121 1.5010 1.0659 1.2087 1.4687 2.3630 1.3335 1.2975 2.2069 1.2236 1.3052 1.6367 1.8129 1.2825 1.4429 2.7089 1.5736 3.3861 1.3134 4.4167 1.4202 6.8879 1.4641 2.5530 1.0821 1.0804 1.0964 2.6372 1.0971 1.0438 1.3357 1.0987 1.3335 2.2922 3.0492 7.7855 5.6879 2.4330 7.5200 1.0705 1.0700 1.0691 1.0665 1.0665 1.0383 1.0606 1.0903 1.0888 1.0974 1.0897 1.1022 1.0962 1.0979 1.0972 1.0894 1.0835 1.0924 1.0887 1.0936 1.0972
irintensity: 0.2216 0.0410 0.0263 0.7216 0.1177 0.7057 1.6807 1.2218 0.4211 0.8696 0.2399 0.0195 0.1512 6.5613 6.2943 1.8988 1.2429 0.5565 0.5998 1.5983 13.0351 2.7624 8.5272 3.7359 2.9138 1.0867 6.9597 7.6711 4.0986 2.3831 5.1366 1.1046 9.4262 2.5247 16.7873 5.2006 8.2318 8.1711 5.2532 19.3750 1.3898 2.4860 3.0214 1.9022 39.2452 9.1392 0.5097 3.5588 29.4003 61.6139 5.0059 14.7849 31.4683 33.1481 13.3449 81.5193 14.6250 0.1002 22.6323 1.8765 25.1418 17.9144 11.1915 11.7334 5.6832 19.4434 13.6617 3.7106 22.1138 54.9470 51.5634 6.1457 66.3742 45.6507 19.4687 5.6076 8.1690 2.0542 13.5884 12.2288 24.6267 20.0410 6.8608 110.2261 9.6140 62.0947 83.8272 51.5549 2.1569 19.4711 6.4131 7.5577 20.6838 4.6943 115.0210 1.0517 55.0306 12.2802 88.6969 2.6082 0.2686 23.8237 24.3636 7.2232 15.5305 51.5089 12.7684 103.3227 241.6113 122.0651 37.3568 283.4335 124.9493 242.5710 47.5628 33.1620 144.8172 28.9345 105.9021 36.1472 61.3810 15.7135 36.2918 14.9329 43.0014 38.3433 39.3563 38.8613 19.8528 20.1323 151.7329 0.9754 0.8467 22.9995 3.4182
temp: 298.150 k
press: 1.00000 atm
elementType: 17 16 8 8 7 7 6 6 6 6 6 6 6 6 6 6 6 6 6 6 6 6 6 6 6 6 1 1 1 1 1 1 1 1 1 1 1 1 1 1 1 1 1 1 1 1 1
symmnumber: 1
zpe: 971768.0 jmol-1
zpe.correction: 0.370127 hartree
zpe.thermalcorrener: 0.393775 hartree
zpe.thermalcorrenthalpy: 0.394719 hartree
zpe.thermalcorrgfe: 0.314657 hartree
zpe.sumelectzpe: -1890.908628 hartree
zpe.sumelectthermal: -1890.884980 hartree
zpe.sumelectthermalent: -1890.884036 hartree
zpe.sumelectthermalfe: -1890.964098 hartree
dipole: 1.0875 2.0126 -0.1382
dipole: 2.2918
quadrupole: -190.3700 -154.2440 -169.8458
quadrupole: 1.6775 -3.9101 4.0817
quadrupole: -18.8834 17.2426 1.6408 1.6775 -3.9101 4.0817
hfenergy: -1891.278755 hartree
pointgroup: C01 [X(C20H21Cl1N2O2S1)]
dipole: 0.3857073 -0.7725503 -0.2595968 debye
polarizability: 442.6263471|-45.3741802|272.4331234|8.6412985|62.7814918|170.9838253 unknown
InChI: InChI=1S/C20H21ClN2O2S/c1-13-2-5-16(22-6-7-23-8-10-25-11-9-23)18-19(24)15-4-3-14(21)12-17(15)26-20(13)18/h2-5,12,22H,6-11H2,1H3
charge 0 multiplicity 1
47 atoms
Cl -7.620139 2.086085 0.404305
S  -3.620016 -1.52095 -0.695737
O  7.71378 0.803295 -0.240691
O  -0.932917 1.600081 1.266358
N  4.864451 0.24952 -0.013438
N  1.171538 0.193569 0.934752
C  3.411372 0.490532 -0.164029
C  5.533837 1.242283 0.869957
C  5.567863 0.184324 -1.323463
C  2.621226 0.101203 1.115899
C  7.015019 0.871957 1.052808
C  7.045336 -0.181095 -1.108398
C  0.392033 -0.764361 0.325573
C  -1.054762 -0.558968 0.189352
C  -1.811093 -1.60535 -0.444048
C  -1.231982 -2.802185 -0.931389
C  0.967089 -1.973338 -0.172281
C  -1.656636 0.68248 0.697562
C  -3.119004 0.959069 0.59199
C  0.169718 -2.951237 -0.774444
C  -4.067273 0.080298 0.009723
C  -2.054285 -3.890524 -1.59572
C  -3.590809 2.197162 1.116707
C  -5.443688 0.417376 -0.051188
C  -4.946285 2.554532 1.068948
C  -5.85595 1.647115 0.479379
H  3.178715 1.553062 -0.426134
H  3.046232 -0.133168 -1.001111
H  5.044156 1.248891 1.8609
H  5.461213 2.274772 0.442907
H  5.510592 1.159674 -1.868959
H  5.08491 -0.587924 -1.951933
H  2.925807 -0.917778 1.421222
H  2.887838 0.778209 1.946875
H  7.547713 1.641992 1.634922
H  7.089615 -0.108175 1.571612
H  7.11548 -1.191703 -0.651047
H  7.602807 -0.163265 -2.059439
H  0.632359 1.027006 1.253481
H  2.042616 -2.141763 -0.078246
H  0.640074 -3.870695 -1.143086
H  -1.408534 -4.730053 -1.902981
H  -2.830752 -4.295103 -0.917413
H  -2.577628 -3.521058 -2.499169
H  -2.845287 2.862157 1.562138
H  -6.168829 -0.266254 -0.502299
H  -5.295819 3.5073 1.474877
