program: Gaussian 09
title: 000227996
version: EM64L-G09RevD.01
frameworkgroup: C1[X(C4H7NO3)]
method: RPBEPBE
basis: SDD
operation: Freq
keyword: #pfreq=noraman
keyword: PBEPBE/SDD
title: #p freq=noraman PBEPBE/SDD
converged: NO YES NO NO
title: Mulliken charges:
elementType: O O O N C C C C H H H H H H H
charge: -0.287108 -0.252704 -0.213782 -0.367842 -0.224272 -0.668240 0.322647 -0.040052 0.235834 0.235828 0.217677 0.232827 0.232827 0.355645 0.220714
chargesum: 0.00000
title: Mulliken charges with hydrogens summed into heavy atoms:
elementType: O O O N C C C C
charge: -0.287108 -0.252704 -0.213782 -0.012197 0.247390 0.015091 0.322647 0.180663
polarizability: 9.48106807e+01 -3.83155954e+00 5.75204448e+01 2.68800518e-03 1.66478400e-03 3.65238024e+01
1716.lowfreq: -12.1489 -0.0011 -0.0009 -0.0006 7.4120 7.4905 39.2420 88.7433 116.8227
frequency: 36.2528 88.7343 116.8226 175.4489 204.2233 244.7681 252.8927 335.9853 410.9362 500.1202 700.0495 721.7119 748.1678 799.2871 828.9407 990.9582 1004.6045 1028.9771 1112.1365 1138.6472 1149.4823 1195.9725 1251.3464 1345.9769 1363.9074 1401.9401 1440.8754 1463.8239 1475.4840 1488.0407 1641.3008 1674.7858 2998.5705 3015.4568 3017.7583 3075.2319 3095.7360 3111.1958 3525.8926
redmass: 2.6630 3.1403 4.9237 2.8791 2.6886 5.8071 1.3081 3.8996 6.2845 4.9527 5.1819 7.0397 1.3758 1.0982 3.6867 4.5749 1.5362 2.8101 2.3428 1.4654 3.5081 3.4980 1.1292 1.2460 1.2714 1.2562 2.0861 1.0399 1.0592 1.0819 8.4533 6.0590 1.0358 1.0590 1.0902 1.1069 1.0985 1.1032 1.0772
irintensity: 1.0543 0.1928 0.2232 3.7983 12.3228 19.4221 2.4840 8.5302 0.5449 22.7955 0.0132 3.4685 163.5225 4.9760 12.2559 40.2911 8.2739 167.8132 32.1603 5.3119 376.8662 213.2728 0.0008 133.5601 32.1909 33.2010 197.4145 12.8881 1.3778 20.8871 444.7154 218.9659 17.0126 12.8246 27.1638 5.8522 26.1281 43.0384 42.9309
temp: 298.150 k
press: 1.00000 atm
elementType: 8 8 8 7 6 6 6 6 1 1 1 1 1 1 1
symmnumber: 1
zpe: 300097.8 jmol-1
zpe.correction: 0.114301 hartree
zpe.thermalcorrener: 0.123205 hartree
zpe.thermalcorrenthalpy: 0.124149 hartree
zpe.thermalcorrgfe: 0.079563 hartree
zpe.sumelectzpe: -436.432242 hartree
zpe.sumelectthermal: -436.423338 hartree
zpe.sumelectthermalent: -436.422394 hartree
zpe.sumelectthermalfe: -436.466980 hartree
dipole: -4.4923 -0.7398 -0.0006
dipole: 4.5528
quadrupole: -53.0272 -50.2871 -46.0446
quadrupole: 3.3252 -0.0031 0.0005
quadrupole: -3.2409 -0.5008 3.7417 3.3252 -0.0031 0.0005
hfenergy: -436.5465433 hartree
pointgroup: C01 [X(C4H7N1O3)]
dipole: -1.7630419 0.3164966 0.0002024 debye
dipolederiv: -1.8165703 0.2074879 -0.0001159 0.4253926 -0.5697696 -0.0001075 -0.0003176 -0.000021 -0.3031735 -0.6706028 -0.0182647 -0.0000364 -0.0262337 -1.0071164 -0.0000776 -0.0000436 -0.0004932 -0.3353143 -1.2115901 -0.1087999 -0.0000058 -0.4289675 -0.519522 -0.0000334 0.0000085 -0.000042 -0.3576027 -2.0092096 -0.3366284 -0.0001371 0.0276125 -0.4495288 -0.0001089 0.0002311 0.0000012 -0.3669588 1.0246552 -0.0109588 0.0001471 0.1725326 0.2450774 -0.0000048 0.0002367 -0.0000525 0.3555173 -0.1176097 0.0774544 0.0000012 0.0584316 -0.0027463 -0.0000116 -0.0000157 -0.0000136 0.0608511 2.401423 0.1262273 0.0002171 0.0491765 1.5367912 0.0002702 0.0002203 0.0005439 0.3448873 2.1477092 0.1793768 -0.0001167 -0.1847115 0.6073336 0.0001816 -0.0003751 0.0001705 0.2015877 -0.0473078 0.0261228 0.0264726 -0.0593243 0.0037587 -0.0876569 -0.0096152 -0.1025092 -0.0546133 -0.0472642 0.0260842 -0.0264272 -0.0593958 0.0035677 0.0876904 0.0095809 0.1025833 -0.0544336 -0.1253409 -0.0710739 -0.000098 -0.0912622 0.0388824 -0.0000665 -0.000116 -0.0000601 0.1203083 0.1133786 -0.015454 -0.0335162 0.0382981 0.0109844 -0.1016501 -0.0064033 -0.1154829 -0.0596488 0.1133541 -0.0155511 0.03359 0.0382358 0.0107672 0.1017397 0.0065386 0.1155451 -0.0594073 0.15611 -0.010091 0.0000333 0.0201405 0.1896651 -0.0000641 0.0000591 -0.0000515 0.3619021 0.0888653 -0.0559317 -0.0000079 0.0200748 -0.0981446 -0.0001006 0.0000112 -0.000118 0.1460984 unknown
polarizability: 94.9133028|3.2929484|57.4178196|0.0028553|0.0083328|36.5238055 unknown
InChI: InChI=1S/C4H7NO3/c1-2-8-4(7)5-3-6/h3,5H,2H2,1H3
charge 0 multiplicity 1
15 atoms
O  -1.11277 0.445764 0.00016
O  0.012392 -1.623017 -0.000702
O  3.483881 0.659554 0.000018
N  1.159643 0.445637 0.000364
C  -2.427556 -0.273439 -0.000587
C  -3.512794 0.796485 -0.000355
C  0.014275 -0.371349 0.000177
C  2.466309 -0.070616 -0.000033
H  -2.464968 -0.918221 -0.896769
H  -2.465478 -0.919126 0.894923
H  -4.506737 0.313637 -0.000869
H  -3.438762 1.435956 0.895584
H  -3.438271 1.436855 -0.895611
H  1.032162 1.462616 0.000775
H  2.482175 -1.178735 -0.000575
