program: Gaussian 09
title: 000227972
version: EM64L-G09RevD.01
frameworkgroup: C1[X(C16H14N2O3)]
method: RPBEPBE
basis: SDD
operation: Freq
keyword: #p
keyword: freq=noraman
keyword: PBEPBE/SDD
title: #p freq=noraman PBEPBE/SDD
converged: YES YES NO NO
title: Mulliken charges:
elementType: O O O N N C C C C C C C C C C C C C C C C H H H H H H H H H H H H H H
charge: -0.223491 -0.209093 -0.281182 -0.400044 -0.488601 -0.166315 0.297845 0.060516 0.125262 -0.398606 -0.354269 -0.206192 -0.216865 0.315052 0.482406 0.451870 -0.450173 -0.341075 -0.402345 -0.351776 -0.808945 0.294959 0.300852 0.262419 0.272230 0.236992 0.239789 0.293846 0.214779 0.304243 0.231070 0.230067 0.230067 0.221878 0.232829
chargesum: 0.00000
title: Mulliken charges with hydrogens summed into heavy atoms:
elementType: O O O N N C C C C C C C C C C C C C C C C
charge: -0.223491 -0.209093 -0.281182 -0.099191 -0.194755 0.128645 0.297845 0.060516 0.125262 -0.136187 -0.082038 0.030799 0.022924 0.315052 0.482406 0.451870 -0.235393 -0.036832 -0.171275 -0.121709 -0.124171
polarizability: 3.21933630e+02 3.18052550e+00 1.55413664e+02 1.34084005e+01 1.57828181e+00 1.42256700e+02
1716.lowfreq: -8.6387 -2.4377 -0.0009 -0.0008 0.0005 4.3514 16.3407 25.2606 27.3291
frequency: 15.4627 25.0646 27.2444 40.5274 68.3423 76.6679 100.0962 138.3027 149.7039 164.5562 192.6606 227.4747 269.7890 298.2333 311.6620 330.6141 373.2472 406.8829 408.0646 422.7753 443.5015 488.3851 507.3897 521.0825 553.6842 568.7158 595.3481 622.3599 633.0703 665.6646 666.8230 703.9165 713.0495 715.7716 744.4705 758.6116 780.7944 789.0406 816.4429 817.9535 840.2268 852.6559 880.7352 903.5642 939.4101 971.6120 977.5094 985.6547 986.9739 1000.9921 1005.2934 1010.8398 1019.8693 1047.2170 1084.9161 1129.5158 1143.4436 1170.5093 1184.1704 1194.8769 1203.7968 1220.9452 1225.0064 1262.5328 1270.2454 1289.6677 1308.2598 1321.6064 1370.1345 1398.4706 1404.1669 1411.6696 1450.1746 1463.5739 1469.4147 1470.3882 1475.7287 1508.2616 1517.4922 1599.0093 1609.0401 1619.7564 1629.6977 1650.9672 1695.6626 2975.6881 3049.0710 3053.3035 3082.7588 3102.4960 3125.1140 3136.7902 3138.1651 3149.1179 3160.4347 3172.9183 3194.1908 3525.0950 3541.8090
redmass: 4.3962 1.5101 2.0611 5.5504 4.7812 7.8772 5.4226 6.1301 5.1079 3.9306 6.1797 5.4407 5.8048 3.6064 5.2965 3.1761 3.4513 2.9632 2.9121 4.0923 1.9843 4.9006 4.3428 2.9287 8.1515 4.5759 1.8681 2.3294 6.5495 5.0818 7.2943 10.1268 6.1875 3.1001 2.9741 5.4571 5.3581 1.6509 3.6736 2.0216 5.4389 1.2973 2.4392 1.8420 1.3529 1.5570 4.4850 1.4389 1.4041 4.3078 1.3341 2.9077 2.0775 1.5406 2.6159 1.3062 2.6097 1.1432 2.0469 1.1675 1.9111 1.9912 2.5109 2.0527 1.9091 1.5469 1.3697 1.5021 4.8405 1.2353 7.9819 3.7165 2.4299 2.5187 1.3146 1.1437 1.3117 2.1262 2.6160 4.9048 7.5908 7.4115 6.2522 4.8277 12.9016 1.0372 1.0841 1.0976 1.0987 1.0885 1.0909 1.0863 1.0955 1.0903 1.0957 1.1004 1.0942 1.0765 1.0772
irintensity: 0.7043 1.2323 0.8530 0.5664 0.2113 10.1702 1.5185 1.8570 1.1621 1.4267 0.7457 7.3285 3.0259 2.2859 34.3196 1.0453 1.2912 5.0996 2.1508 10.0914 3.3264 23.9952 26.5594 42.4496 5.1528 17.5259 58.2416 58.9078 1.8934 22.7935 6.7936 27.2685 6.6104 0.8786 27.2313 4.5565 6.0111 43.7665 224.9440 204.0584 1.3606 24.7589 8.8711 2.9374 3.2885 27.3968 222.1244 3.9742 3.2388 4.5755 0.1860 1.6231 9.4154 11.6321 23.9877 21.5089 28.2771 31.2107 191.7192 23.6563 66.3835 192.9452 82.6062 85.9895 19.1724 43.4802 1.6486 45.6023 132.4046 2.4013 5.3346 20.1766 38.4225 23.9094 98.9105 64.6701 334.7712 37.8517 635.3544 70.7185 3.5792 12.5654 29.4494 157.9329 365.5110 47.5464 34.5672 21.7340 20.3401 22.9759 21.9011 0.7411 19.1765 6.8831 9.6705 19.5473 4.6013 8.7581 17.9023
temp: 298.150 k
press: 1.00000 atm
elementType: 8 8 8 7 7 6 6 6 6 6 6 6 6 6 6 6 6 6 6 6 6 1 1 1 1 1 1 1 1 1 1 1 1 1 1
symmnumber: 1
zpe: 704218.0 jmol-1
zpe.correction: 0.268222 hartree
zpe.thermalcorrener: 0.286583 hartree
zpe.thermalcorrenthalpy: 0.287527 hartree
zpe.thermalcorrgfe: 0.218319 hartree
zpe.sumelectzpe: -951.841884 hartree
zpe.sumelectthermal: -951.823524 hartree
zpe.sumelectthermalent: -951.822579 hartree
zpe.sumelectthermalfe: -951.891787 hartree
dipole: -0.9953 -6.0315 3.3120
dipole: 6.9526
quadrupole: -102.4339 -133.7177 -116.8036
quadrupole: -21.9679 -1.9879 -0.6058
quadrupole: 15.2178 -16.0660 0.8481 -21.9679 -1.9879 -0.6058
hfenergy: -952.1101062 hartree
pointgroup: C01[X(C16H14N2O3)]
dipole: -0.468059 1.9259365 -1.8851973 debye
polarizability: 322.0562216|-0.9303462|155.03249|-12.9808075|-2.4289024|142.5152815 unknown
InChI: InChI=1S/C16H14N2O3/c1-10-6-8-11(9-7-10)17-16(20)18-14-12-4-2-3-5-13(12)15(19)21-14/h2-9,14,17-18H,1H3
charge 0 multiplicity 1
35 atoms
O  2.282828 -1.522762 0.738451
O  4.339985 -2.587908 0.385734
O  -0.879666 0.204213 1.631662
N  0.572414 -0.047695 -0.187336
N  -1.740103 -0.228423 -0.526667
C  1.739993 -0.094546 0.638895
C  2.931664 0.695562 0.125107
C  4.047398 -0.156132 -0.003375
C  3.661806 -1.546303 0.372388
C  3.027525 2.062546 -0.189563
C  5.298236 0.320897 -0.44119
C  4.280816 2.554099 -0.632512
C  5.40506 1.695053 -0.755226
C  -0.71858 -0.020102 0.397889
C  -3.148478 -0.159413 -0.302554
C  -5.994385 -0.05197 -0.017555
C  -3.995678 -0.401288 -1.41434
C  -3.726101 0.136063 0.960222
C  -5.396989 -0.34758 -1.268274
C  -5.129421 0.186788 1.08177
C  -7.503503 0.001153 0.146702
H  1.425826 0.173845 1.663333
H  0.694151 -0.181793 -1.19282
H  2.163883 2.728667 -0.093487
H  6.150034 -0.360747 -0.530241
H  4.386086 3.615486 -0.882473
H  6.36158 2.104829 -1.096489
H  -1.470264 -0.48852 -1.477815
H  -3.561422 -0.632121 -2.396487
H  -3.077604 0.312476 1.81999
H  -6.033291 -0.538976 -2.140365
H  -5.562845 0.415372 2.063437
H  -7.832454 0.980308 0.542551
H  -8.021169 -0.164218 -0.813897
H  -7.858534 -0.770463 0.855931
