program: Gaussian 09
title: 000021504
version: EM64L-G09RevD.01
frameworkgroup: C1[X(C7H7N3S)]
method: RPBEPBE
basis: SDD
operation: Freq
keyword: #pfreq=noraman
keyword: PBEPBE/SDD
title: #p freq=noraman PBEPBE/SDD
converged: NO YES NO YES
title: Mulliken charges:
elementType: S N N N C C C C C C C H H H H H H H
charge: 0.176063 -0.036984 -0.710960 -0.573861 -0.289697 0.364925 -0.510733 0.539882 -0.315373 -0.429905 -0.175159 0.232405 0.245971 0.216219 0.304600 0.304273 0.326151 0.332183
chargesum: 0.00000
title: Mulliken charges with hydrogens summed into heavy atoms:
elementType: S N N N C C C C C C C
charge: 0.176063 -0.036984 -0.102087 0.084472 -0.289697 0.364925 -0.278328 0.539882 -0.069402 -0.213686 -0.175159
polarizability: 1.93424779e+02 -7.14882692e-01 1.14268349e+02 -1.03137836e-02 -2.30017566e-03 4.39635061e+01
1716.lowfreq: -9.2862 -4.2610 -0.0022 0.0006 0.0010 7.6135 95.9487 178.0748 213.0738
frequency: 95.9465 178.0747 213.0729 225.6609 251.4814 317.1902 333.6404 334.1557 366.2691 405.5505 417.9879 422.6996 433.9503 505.6517 547.8454 564.5454 597.0271 602.7755 686.0429 725.9337 800.4593 808.8619 838.7992 884.2551 937.8132 1012.6621 1029.0494 1055.2677 1132.9615 1232.4005 1244.0316 1290.7942 1311.1064 1377.6455 1440.8703 1476.2549 1563.6906 1591.2066 1627.2412 1642.6618 1649.6502 3126.7518 3141.2636 3166.7155 3561.4678 3572.7294 3713.3089 3714.6115
redmass: 4.8862 5.7082 4.8962 4.1173 1.2373 1.2231 3.8570 1.0503 2.1172 5.1099 1.7573 6.8385 2.5295 6.6771 4.5565 7.0279 3.3268 6.6233 6.8924 3.6928 5.5556 1.4594 1.6617 5.2537 1.3586 2.6456 1.5554 2.1160 1.2658 1.6950 2.6627 1.8517 4.5264 4.9138 4.3700 4.2793 6.4849 1.3671 3.2935 1.3762 4.5479 1.0890 1.0919 1.0953 1.0449 1.0448 1.1041 1.1046
irintensity: 11.2534 0.4251 0.0104 8.9042 76.1042 349.4249 1.3235 2.8029 117.9600 0.2008 93.5114 1.3547 39.4088 1.6147 18.2409 9.1750 3.0980 16.4406 3.3118 1.4313 25.0263 39.8044 50.5486 18.0778 0.2523 13.5431 0.5213 15.2568 11.1666 36.0583 99.2011 10.4395 53.9325 12.5517 0.2686 156.2649 92.9151 29.3962 1.1271 290.4749 552.3522 20.7452 13.5448 10.2879 147.7975 69.4134 19.4582 46.7859
temp: 298.150 k
press: 1.00000 atm
elementType: 16 7 7 7 6 6 6 6 6 6 6 1 1 1 1 1 1 1
symmnumber: 1
zpe: 347934.1 jmol-1
zpe.correction: 0.132521 hartree
zpe.thermalcorrener: 0.142567 hartree
zpe.thermalcorrenthalpy: 0.143511 hartree
zpe.thermalcorrgfe: 0.097804 hartree
zpe.sumelectzpe: -832.495327 hartree
zpe.sumelectthermal: -832.485281 hartree
zpe.sumelectthermalent: -832.484337 hartree
zpe.sumelectthermalfe: -832.530044 hartree
dipole: -0.4934 -1.3782 0.0001
dipole: 1.4639
quadrupole: -37.3844 -67.5747 -77.9527
quadrupole: 1.6430 -0.0030 -0.0004
quadrupole: 23.5862 -6.6041 -16.9821 1.6430 -0.0030 -0.0004
hfenergy: -832.6278478 hartree
pointgroup: C01[X(C7H7N3S1)]
dipole: 0.2209565 0.5318684 0.0000435 debye
dipolederiv: -0.4840873 -0.0611833 -0.0000381 -0.095012 -0.4763525 -0.0000177 -0.0000392 -0.0000112 0.0263975 -0.9965302 0.1269196 -0.0000518 0.4725066 -0.823704 0.0000196 -0.0000416 -0.0000126 -0.2265199 -1.6449331 -0.3279637 -0.000071 -0.5013989 -0.2025398 -0.0000175 -0.0000674 -0.0000033 -0.7663695 -1.9063102 0.0587022 -0.0000728 -0.0758774 -0.2422985 -0.0000029 -0.0000903 0.0000088 -0.7241645 0.548899 -0.0332906 0.0000493 -0.3892792 0.1598117 -0.0000221 0.0000369 0.0000014 -0.0601935 0.443649 0.0436351 0.0000306 0.2224411 -0.1722334 0.0000095 0.0000223 -0.0000009 0.0031973 -0.5158956 -0.1619654 -0.0000294 0.3360879 0.0382221 0.0000342 -0.0000095 -0.0000018 -0.2165598 1.6178628 0.3773653 0.0001181 0.5490408 0.1285556 0.0000379 0.000122 0.0000275 0.1405417 0.3149755 -0.1827855 0.0000248 0.0985209 0.1224848 0.0000158 0.0000402 -0.000009 -0.1237024 -0.3292366 0.0345666 -0.0000018 -0.581498 -0.0249313 -0.0000337 -0.0000249 0.0000114 -0.2538249 1.988416 0.0657721 0.0001271 -0.121354 1.0868538 0.0000168 0.0001502 0.000032 0.0900868 0.0452056 -0.0367427 -0.0000112 -0.068515 -0.0714188 -0.0000139 -0.0000127 -0.0000113 0.1803449 0.0838046 -0.0470422 -0.0000073 -0.0170581 -0.071421 -0.0000089 -0.0000058 -0.0000086 0.1625629 -0.0928922 0.1196366 -0.000016 0.0992205 0.0035104 0.0000016 -0.0000171 0.0000025 0.1724449 0.2207808 0.0132084 -0.0000129 -0.0084695 0.1158096 -0.0000088 -0.0000183 -0.0000076 0.3918269 0.1906856 0.0346308 -0.0000139 0.0667019 0.1208798 -0.000005 -0.000016 -0.0000088 0.3919284 0.2843036 -0.0327727 -0.00001 -0.0747443 0.1455336 -0.0000079 -0.0000199 -0.0000038 0.4046673 0.2313028 0.0093093 -0.0000137 0.0886868 0.1632378 0.0000029 -0.0000087 -0.0000048 0.4073361 unknown
polarizability: 193.1561153|-4.6588995|114.5370124|0.0104158|0.0017823|43.9635061 unknown
InChI: InChI=1S/C7H7N3S/c8-4-1-2-5-6(3-4)11-7(9)10-5/h1-3H,8-9H2
charge 0 multiplicity 1
18 atoms
S  -1.581552 1.693097 -0.000167
N  -1.730012 -1.019729 -0.00025
N  3.67051 0.682595 0.00019
N  -3.868358 0.058628 -0.000361
C  -0.04506 0.707494 -0.000076
C  -0.357223 -0.69075 -0.000149
C  1.272223 1.189871 0.000034
C  2.340671 0.245561 0.000081
C  0.713166 -1.613566 -0.000107
C  2.041971 -1.151967 0.000011
C  -2.491463 0.050472 -0.000259
H  1.487668 2.263628 0.000086
H  0.490239 -2.684735 -0.000157
H  2.866188 -1.875331 0.000049
H  4.434682 0.014454 0.000231
H  3.896489 1.672176 0.000244
H  -4.399065 0.923373 -0.000395
H  -4.352572 -0.83607 -0.000405
