program: Gaussian 09
title: 000021566
version: EM64L-G09RevD.01
frameworkgroup: C1[X(C16H14Cl2)]
method: RPBEPBE
basis: SDD
operation: Freq
keyword: #p
keyword: freq=noraman
keyword: PBEPBE/SDD
title: #p freq=noraman PBEPBE/SDD
converged: YES YES NO NO
title: Mulliken charges:
elementType: Cl Cl C C C C C C C C C C C C C C C C H H H H H H H H H H H H H H
charge: 0.030873 0.030564 0.292861 0.292842 0.507716 -0.384970 -0.384876 -0.378067 -0.378029 0.435154 0.435171 -0.385086 -0.384955 -0.383659 -0.383808 -0.807176 -0.807219 -0.663376 0.256267 0.256192 0.249147 0.249107 0.231438 0.231441 0.231199 0.231203 0.225588 0.225851 0.238569 0.238568 0.225593 0.225876
chargesum: 0.00000
title: Mulliken charges with hydrogens summed into heavy atoms:
elementType: Cl Cl C C C C C C C C C C C C C C C C
charge: 0.030873 0.030564 0.292861 0.292842 0.507716 -0.128703 -0.128684 -0.128920 -0.128923 0.435154 0.435171 -0.153648 -0.153513 -0.152459 -0.152605 -0.117168 -0.117182 -0.663376
polarizability: 2.64271128e+02 1.48626289e-02 2.09550809e+02 -1.42202617e+01 -3.68526667e-04 1.25961911e+02
1716.lowfreq: -8.0367 0.0013 0.0018 0.0024 4.2252 6.7415 26.8457 35.1997 36.7007
frequency: 26.7710 35.1947 36.6824 45.3402 49.7975 59.0248 68.6215 115.4175 153.8323 161.5171 221.2606 241.7664 253.8193 288.0823 314.8637 339.1900 347.9840 375.5553 379.5597 405.7484 408.3797 485.6680 498.9076 535.9503 580.5013 618.9898 635.0173 660.1060 708.1227 729.0215 747.5544 760.9931 801.0821 805.7947 831.5582 837.7893 849.8336 851.8861 930.7488 958.8956 964.5181 976.7862 977.6449 988.2374 988.6267 1013.4153 1016.1677 1046.5889 1046.6971 1126.7583 1126.9712 1167.5856 1196.2855 1199.7725 1226.3413 1226.7285 1280.3205 1309.0238 1310.1643 1358.2613 1362.3540 1396.7547 1396.8343 1406.0209 1406.5354 1469.8567 1470.0023 1472.9313 1472.9804 1501.0684 1506.1364 1570.2188 1571.8046 1587.8939 1618.8133 1621.2752 2975.3548 2975.4794 3056.6336 3056.7214 3085.9120 3085.9208 3121.1430 3121.2253 3123.2864 3123.5252 3148.3951 3148.7636 3155.7658 3156.2352
redmass: 2.9880 1.0460 1.1118 4.0511 5.8606 5.3583 6.1595 6.2649 4.1744 4.8500 11.0844 4.2319 13.2188 4.0757 6.8661 3.4621 3.8260 5.5617 4.3379 2.9307 2.8812 3.1941 3.4480 5.3342 4.1643 6.0906 6.8811 5.8254 4.3410 3.1612 3.2380 5.8582 4.4847 3.9803 1.7186 1.7873 1.2593 1.2453 4.4633 1.3234 1.4725 1.3809 1.3746 1.4059 1.4106 3.0450 2.7113 1.5699 1.5699 1.3219 1.3194 3.7897 1.1042 1.1515 2.7874 2.9493 4.0107 1.2826 1.3623 5.2172 4.9245 1.2214 1.2218 3.3846 3.2422 1.0952 1.0955 1.0540 1.0538 2.6024 2.7240 6.4214 5.8645 9.8999 6.3190 6.4448 1.0386 1.0386 1.0948 1.0948 1.0999 1.0999 1.0882 1.0882 1.0885 1.0884 1.0956 1.0956 1.0963 1.0963
irintensity: 0.1032 0.4072 0.7891 0.3339 0.0193 0.2882 0.0483 0.2311 0.1578 1.6685 0.8661 0.0550 0.3990 0.2188 0.4338 0.6808 1.7977 4.3445 6.7622 0.5177 0.3509 15.1921 0.0476 23.5720 21.1879 4.8020 0.4089 4.7610 15.7228 10.7357 41.7284 54.9518 40.9550 11.7896 68.6333 8.3703 0.7439 0.0008 15.7062 0.4753 12.2898 0.0447 0.0042 0.6793 0.3381 2.4041 11.9458 40.9329 0.9869 13.9732 4.0962 8.9084 9.2078 0.1170 0.5663 1.6006 4.0995 1.5897 1.0932 0.2368 1.4775 13.8798 6.9200 3.6327 3.4386 20.7307 9.3889 12.6740 12.9784 8.7100 39.7691 8.6046 0.4004 18.2120 14.1851 11.9290 57.0155 18.3365 20.7084 22.3399 18.2111 16.7824 10.4433 9.8830 42.0004 6.4254 17.5438 21.5809 2.8142 1.9140
temp: 298.150 k
press: 1.00000 atm
elementType: 17 17 6 6 6 6 6 6 6 6 6 6 6 6 6 6 6 6 1 1 1 1 1 1 1 1 1 1 1 1 1 1
symmnumber: 1
zpe: 645203.3 jmol-1
zpe.correction: 0.245745 hartree
zpe.thermalcorrener: 0.263549 hartree
zpe.thermalcorrenthalpy: 0.264493 hartree
zpe.thermalcorrgfe: 0.196575 hartree
zpe.sumelectzpe: -1536.939855 hartree
zpe.sumelectthermal: -1536.922051 hartree
zpe.sumelectthermalent: -1536.921107 hartree
zpe.sumelectthermalfe: -1536.989024 hartree
dipole: -0.0018 -3.2967 -0.0008
dipole: 3.2967
quadrupole: -101.6341 -119.5401 -116.4512
quadrupole: -0.0082 -4.2070 -0.0005
quadrupole: 10.9077 -6.9983 -3.9094 -0.0082 -4.2070 -0.0005
hfenergy: -1537.1855998 hartree
pointgroup: C01 [X(C16H14Cl2)]
dipole: 0.0051525 1.2970229 0.0011445 debye
polarizability: 261.1938035|-0.2657307|209.5521213|24.8633998|-0.0593316|129.0379233 unknown
InChI: InChI=1S/C16H14Cl2/c1-11-3-7-13(8-4-11)15(16(17)18)14-9-5-12(2)6-10-14/h3-10H,1-2H3
charge 0 multiplicity 1
32 atoms
Cl -1.506101 -3.527439 0.104061
Cl 1.481462 -3.54104 -0.109052
C  1.273249 -0.356659 0.073878
C  -1.268915 -0.345067 -0.07581
C  -0.001652 -1.143857 -0.001801
C  2.266788 -0.61745 1.053941
C  -2.265573 -0.595567 -1.055404
C  1.479086 0.728443 -0.819546
C  -1.464523 0.741163 0.818689
C  3.653413 1.24315 0.219533
C  -3.634899 1.276581 -0.218313
C  3.43199 0.173524 1.125431
C  -3.423625 0.205936 -1.125405
C  2.652241 1.507171 -0.751028
C  -2.630533 1.530571 0.751705
C  4.92713 2.067487 0.276234
C  -4.901236 2.112206 -0.273068
C  -0.007942 -2.50945 -0.002464
H  2.118236 -1.430677 1.7717
H  -2.124973 -1.409293 -1.774293
H  0.714283 0.959101 -1.569153
H  -0.697223 0.964208 1.568118
H  4.180398 -0.040306 1.898233
H  -4.174318 -0.000718 -1.897935
H  2.792032 2.334204 -1.457744
H  -2.762068 2.358085 1.459417
H  4.762279 3.094673 -0.093845
H  5.323748 2.132325 1.30478
H  5.719278 1.615425 -0.352195
H  -5.697463 1.665482 0.354046
H  -4.727501 3.136932 0.099758
H  -5.297167 2.183257 -1.301472
