program: Gaussian 09
title: 000227952
version: EM64L-G09RevD.01
frameworkgroup: C1[X(C15H29NO3)]
method: RPBEPBE
basis: SDD
operation: Freq
keyword: #p
keyword: freq=noraman
keyword: PBEPBE/SDD
title: #p freq=noraman PBEPBE/SDD
converged: YES YES NO NO
title: Mulliken charges:
elementType: O O O N C C C C C C C C C C C C C C C H H H H H H H H H H H H H H H H H H H H H H H H H H H H H
charge: -0.401829 -0.243459 -0.277449 -0.408215 -0.387573 -0.386743 -0.375938 -0.384280 -0.380460 -0.382629 -0.405060 -0.372329 -0.353756 -0.140022 -0.356433 0.119745 -0.696650 0.243861 -0.773936 0.194233 0.193683 0.194345 0.195108 0.193607 0.198970 0.193007 0.193156 0.202215 0.206926 0.192290 0.192449 0.260035 0.229752 0.189194 0.189279 0.301213 0.187783 0.187849 0.194722 0.194555 0.336287 0.209612 0.209828 0.214922 0.387080 0.251312 0.253724 0.216020
chargesum: 0.00000
title: Mulliken charges with hydrogens summed into heavy atoms:
elementType: O O O N C C C C C C C C C C C C C C C
charge: -0.014750 -0.243459 -0.277449 -0.071928 0.000344 0.002710 0.016638 0.001882 0.028681 0.002110 0.084727 0.006144 0.021876 0.161192 0.032844 0.119745 -0.062288 0.243861 -0.052880
polarizability: 2.07910921e+02 -3.68421269e+00 1.71565717e+02 -1.84515577e+00 2.70023751e-02 1.61003211e+02
1716.lowfreq: -7.5828 -0.0010 -0.0007 0.0008 6.2847 7.3667 9.6490 25.8101 28.8746
frequency: 7.7341 25.2206 28.8092 34.1913 47.4722 57.3021 63.0982 71.0160 72.7711 75.8601 96.6804 101.0946 114.4735 127.0519 134.4730 149.2191 152.3323 162.2039 175.4957 227.8424 231.7093 244.9464 281.5078 318.1219 339.2083 368.9594 386.2568 456.6072 474.7122 487.7121 515.1982 568.5802 580.3905 611.6037 627.2420 639.8917 717.8965 720.1973 726.1005 733.2905 739.4095 764.4910 801.5632 832.2632 863.2497 887.8791 899.4140 922.0009 965.0442 978.0406 985.5930 986.7220 1002.5167 1021.8545 1024.5272 1042.5946 1047.4382 1060.9443 1062.9913 1076.0337 1079.1653 1080.6643 1083.8482 1112.3893 1122.3729 1163.2250 1181.4902 1196.4586 1205.5432 1218.4087 1232.4306 1239.6398 1250.5275 1261.1232 1265.5888 1275.3487 1278.7287 1280.7082 1283.3433 1290.4498 1292.2201 1296.1606 1301.6286 1324.2665 1342.5376 1351.7127 1353.3472 1355.5669 1356.6350 1367.3882 1387.9021 1388.6211 1450.8319 1457.9381 1458.4896 1460.3507 1462.3047 1463.0299 1465.3650 1466.4542 1470.9402 1476.1249 1476.2679 1481.2514 1485.4618 1485.7580 1487.9138 1606.9124 1648.5416 2948.3058 2948.7583 2950.8465 2951.2088 2954.0380 2956.4711 2960.7706 2965.2541 2967.9108 2971.0750 2981.7554 2984.9689 2989.9907 2997.0741 2997.3944 2999.9621 3005.0719 3010.6194 3015.4517 3025.9162 3035.4259 3042.6031 3067.6400 3069.7516 3070.5231 3097.3799 3102.5745 3517.9534 3521.0675
redmass: 3.7126 2.9595 4.3175 2.1548 4.3126 4.7943 2.3518 2.1123 2.1705 1.9297 2.3026 2.4945 2.2095 2.6912 2.7237 2.0345 2.3464 3.3262 3.6700 1.1336 3.0958 4.5038 3.7772 3.7220 4.2086 3.4043 3.3029 3.0857 3.1608 3.1592 2.7517 3.4558 2.2517 2.9065 1.3652 1.7415 1.0584 1.0678 1.0878 4.4475 1.1335 1.1997 1.3750 2.2640 1.4666 1.9034 2.4381 1.5307 1.7188 2.1426 4.0660 1.5722 2.8804 1.2789 2.8377 1.6516 2.8016 2.8312 2.5939 2.3048 2.4647 2.0901 2.3052 2.0547 2.7587 2.2818 1.8105 1.3676 1.4529 1.4088 1.3382 1.3974 1.4641 1.3204 1.5297 1.0196 1.3458 1.2044 1.0506 1.0927 1.1338 1.1226 1.3157 1.3525 1.4373 1.8014 1.7809 1.7118 1.6772 1.6772 1.2302 1.2175 1.0468 1.0833 1.0761 1.0966 1.0762 1.0913 1.0881 1.0946 1.0850 1.0732 1.0537 1.0897 1.1588 1.8096 1.0933 7.0489 8.1356 1.0588 1.0587 1.0592 1.0593 1.0594 1.0598 1.0596 1.0592 1.0584 1.0368 1.0963 1.0973 1.0987 1.0979 1.0372 1.0699 1.1014 1.0742 1.1031 1.1045 1.1047 1.1045 1.1007 1.0993 1.1039 1.0986 1.1003 1.0648 1.0775
irintensity: 0.1469 0.6068 0.0892 0.3248 2.1443 0.0458 0.0521 8.3217 0.4921 0.7102 1.9722 0.7500 0.2029 2.9239 5.9493 0.0434 0.9808 0.8343 3.0832 0.0055 0.3898 1.8301 0.4059 0.3080 1.8918 0.2345 1.4092 18.2006 3.2535 22.8100 35.4008 33.4172 13.7891 12.1556 26.4467 192.4122 18.3080 0.0254 7.9158 13.6931 0.5001 6.4023 1.2110 1.0465 4.4423 4.6792 4.5737 9.0723 19.5766 5.9755 0.9762 1.8866 3.0376 0.3604 0.1975 16.5106 5.7118 57.8725 138.3117 41.3086 0.6764 1.0483 7.8145 2.6651 13.2075 3.1439 0.4083 11.1224 6.0655 5.0612 1.6205 2.3033 8.9463 2.0749 2.1285 0.3484 3.4125 1.5097 0.1796 0.3108 0.3828 3.8811 2.3706 0.7756 3.3755 50.4800 14.5947 19.1235 2.5632 40.1014 63.1412 11.1396 16.8062 6.9205 0.1755 24.0376 2.7055 28.6811 15.3248 11.0543 0.3281 4.8188 9.3587 1.7510 34.0907 177.3480 35.7173 233.5173 140.6130 0.0182 0.0677 0.0378 0.6460 0.6355 2.1254 7.4826 78.8342 229.7038 36.0732 0.1343 0.1435 0.1401 0.5478 10.1247 17.1315 0.3014 19.1827 0.7693 6.9862 1.4330 265.1630 97.5036 55.2960 38.5120 11.9299 17.0722 49.3223 40.8924
temp: 298.150 k
press: 1.00000 atm
elementType: 8 8 8 7 6 6 6 6 6 6 6 6 6 6 6 6 6 6 6 1 1 1 1 1 1 1 1 1 1 1 1 1 1 1 1 1 1 1 1 1 1 1 1 1 1 1 1 1
symmnumber: 1
zpe: 1103855.2 jmol-1
zpe.correction: 0.420436 hartree
zpe.thermalcorrener: 0.444769 hartree
zpe.thermalcorrenthalpy: 0.445713 hartree
zpe.thermalcorrgfe: 0.360844 hartree
zpe.sumelectzpe: -867.898719 hartree
zpe.sumelectthermal: -867.874386 hartree
zpe.sumelectthermalent: -867.873441 hartree
zpe.sumelectthermalfe: -867.958311 hartree
dipole: 1.1484 -1.7637 1.9037
dipole: 2.8379
quadrupole: -128.7373 -111.2025 -126.3424
quadrupole: 8.6641 -10.7332 8.9040
quadrupole: -6.6432 10.8916 -4.2483 8.6641 -10.7332 8.9040
hfenergy: -868.3191549 hartree
pointgroup: C01 [X(C15H29N1O3)]
dipole: -0.4551327 0.7397958 0.7015235 debye
polarizability: 207.9045414|-3.5123169|171.510565|2.2397091|-0.7102293|161.0647423 unknown
InChI: InChI=1S/C15H29NO3/c1-3-4-5-6-7-8-9-10-11-12-14(15(18)19)16-13(2)17/h14,16,18H,3-12H2,1-2H3
charge 0 multiplicity 1
48 atoms
O  4.44771 2.839262 -0.513571
O  4.606789 1.885185 1.596723
O  5.054544 -2.198482 -1.081458
N  4.574062 -0.648729 0.575145
C  -0.829629 0.282756 0.060399
C  -2.1766 0.085929 -0.670805
C  0.393384 0.22041 -0.882211
C  -3.397836 0.139366 0.274763
C  1.737311 0.414704 -0.144386
C  -4.746451 -0.061074 -0.452599
C  2.946274 0.333837 -1.098657
C  -5.9659 -0.011431 0.495713
C  -7.315714 -0.216413 -0.228284
C  4.33449 0.433235 -0.387746
C  -8.533561 -0.167308 0.722843
C  4.483889 1.753063 0.356283
C  -9.878389 -0.376251 -0.006465
C  4.942051 -1.91384 0.152247
C  5.198072 -2.93326 1.257634
H  -0.7239 -0.492649 0.84786
H  -0.838166 1.260197 0.586981
H  -2.28593 0.863935 -1.455236
H  -2.166423 -0.889469 -1.200941
H  0.289632 0.995169 -1.670391
H  0.403024 -0.757443 -1.407078
H  -3.408963 1.115265 0.804268
H  -3.286601 -0.637757 1.059921
H  1.725561 1.395062 0.376602
H  1.836738 -0.35957 0.642857
H  -4.859971 0.716921 -1.236507
H  -4.734894 -1.036214 -0.983337
H  2.944861 -0.629322 -1.64125
H  2.893756 1.141084 -1.853263
H  -5.978909 0.964735 1.024787
H  -5.850326 -0.78778 1.281092
H  5.107252 0.378662 -1.179543
H  -7.434031 0.559703 -1.013437
H  -7.304593 -1.192697 -0.757066
H  -8.412551 -0.941305 1.508285
H  -8.544653 0.809207 1.249157
H  4.548085 -0.400857 1.568229
H  -10.035657 0.401588 -0.777601
H  -9.905696 -1.359478 -0.513328
H  -10.732049 -0.334078 0.695006
H  4.533399 3.68497 0.004494
H  4.489362 -3.772398 1.14732
H  6.213794 -3.346863 1.136102
H  5.099749 -2.51438 2.273851
