program: Gaussian 09
title: 000227943
version: EM64L-G09RevD.01
frameworkgroup: C1[X(C12H15NO3)]
method: RPBEPBE
basis: SDD
operation: Freq
keyword: #p
keyword: freq=noraman
keyword: PBEPBE/SDD
title: #p freq=noraman PBEPBE/SDD
converged: YES YES NO NO
title: Mulliken charges:
elementType: O O O N C C C C C C C C C C C C H H H H H H H H H H H H H H H
charge: -0.446473 -0.214029 -0.273838 -0.407692 -0.423595 -0.132209 -0.564650 0.506076 0.137070 -0.417349 -0.400383 0.247833 -0.224863 -0.227873 -0.242528 -0.774946 0.249367 0.274291 0.304229 0.214977 0.215410 0.345049 0.234231 0.232951 0.224030 0.224024 0.227515 0.255055 0.213816 0.253017 0.391487
chargesum: 0.00000
title: Mulliken charges with hydrogens summed into heavy atoms:
elementType: O O O N C C C C C C C C C C C C
charge: -0.054986 -0.214029 -0.273838 -0.062643 0.100064 0.172020 -0.134263 0.506076 0.137070 -0.183119 -0.167432 0.247833 -0.000833 -0.003849 -0.015014 -0.053058
polarizability: 1.68301895e+02 2.69238269e+00 1.56423510e+02 1.44847753e+01 8.48043113e-01 9.87755763e+01
1716.lowfreq: -5.5730 -0.0003 0.0004 0.0006 3.4650 9.9977 18.2164 24.9346 39.2781
frequency: 17.5164 24.6022 39.2533 49.7852 61.3268 74.3675 77.7328 97.5271 142.4651 188.8975 236.3599 269.7770 308.3704 344.2147 356.0714 402.9470 438.0212 493.3242 511.3998 534.7695 569.1970 580.4180 615.1048 616.5283 617.6362 646.9010 704.4627 718.9570 754.3535 772.1176 815.0516 838.4312 854.5568 896.7094 925.6373 947.1351 975.9454 980.1811 990.0443 993.9906 1008.2209 1026.6488 1042.2320 1051.6659 1066.0650 1097.7734 1130.5931 1171.6711 1178.6664 1187.5435 1218.2056 1221.8477 1240.8932 1275.3681 1292.5707 1306.1926 1325.9150 1334.1439 1352.5870 1383.3505 1388.3790 1441.2094 1450.3409 1460.0266 1463.9465 1477.6963 1481.5327 1484.4762 1593.9944 1610.8788 1614.5404 1674.8421 2980.0077 2997.9163 2999.3318 3017.8859 3034.9479 3084.5825 3097.9178 3101.9826 3115.0592 3115.5762 3131.6389 3143.6960 3162.2534 3524.3528 3558.1171
redmass: 3.9475 4.7568 4.1089 3.6881 1.6636 2.6257 4.6312 4.2458 4.4985 4.3371 3.5641 3.7982 3.5674 2.7258 4.4313 2.8208 3.6885 3.4007 4.0563 2.8899 2.7209 2.0825 2.2910 2.0317 5.5042 1.8443 1.9113 3.8700 1.9449 1.4242 2.8278 3.9753 1.2528 2.3314 1.7883 4.2882 1.3986 1.6989 5.9780 1.3272 1.7587 2.2126 1.6513 3.4805 1.7309 1.7019 2.8935 1.0658 1.3291 1.1193 1.7968 1.6660 1.5757 1.3079 1.7173 1.4816 1.4822 1.4244 1.3837 7.5676 1.2329 2.1708 1.0456 1.1402 1.1775 1.6048 1.2461 2.0338 6.0370 6.5052 6.1687 9.1023 1.0590 1.0363 1.0791 1.0631 1.1009 1.1042 1.0978 1.1010 1.0868 1.0874 1.0908 1.0958 1.1015 1.0644 1.0784
irintensity: 0.2161 0.4858 6.6254 0.6984 4.7544 0.6837 3.1517 0.9835 6.0619 3.7710 1.9431 3.0714 0.8261 0.2380 1.8673 0.0093 8.6541 17.8725 30.4774 79.7228 35.0684 3.9725 35.7437 23.8529 3.1149 147.5348 54.3179 7.2838 49.7993 10.3534 12.7781 0.3436 0.0373 2.0514 5.1642 46.0754 1.1629 23.1462 0.1014 0.1899 45.1575 8.4308 16.0038 28.0308 98.8917 61.6406 6.9042 0.5726 22.5414 0.2156 0.6068 1.3634 26.0458 2.8834 33.5905 18.5515 10.8700 8.0878 3.5694 0.1042 68.8263 7.2195 15.4670 54.7566 105.2886 170.0268 34.0754 17.0889 1.4024 146.9386 12.6711 201.7720 25.7710 10.3974 12.9708 13.5904 13.7063 11.4459 8.4353 20.3017 9.4109 6.2366 10.7165 43.1505 24.1811 34.2869 52.2797
temp: 298.150 k
press: 1.00000 atm
elementType: 8 8 8 7 6 6 6 6 6 6 6 6 6 6 6 6 1 1 1 1 1 1 1 1 1 1 1 1 1 1 1
symmnumber: 1
zpe: 655561.8 jmol-1
zpe.correction: 0.249690 hartree
zpe.thermalcorrener: 0.265963 hartree
zpe.thermalcorrenthalpy: 0.266907 hartree
zpe.thermalcorrgfe: 0.202112 hartree
zpe.sumelectzpe: -745.532646 hartree
zpe.sumelectthermal: -745.516373 hartree
zpe.sumelectthermalent: -745.515429 hartree
zpe.sumelectthermalfe: -745.580225 hartree
dipole: -1.0088 0.8003 -4.1090
dipole: 4.3061
quadrupole: -83.9435 -93.8306 -99.8110
quadrupole: -3.6553 12.6355 0.8617
quadrupole: 8.5849 -1.3022 -7.2826 -3.6553 12.6355 0.8617
hfenergy: -745.7823363 hartree
pointgroup: C01 [X(C12H15N1O3)]
dipole: -0.3591282 0.3475243 -1.6187559 debye
polarizability: 167.5334212|2.3818506|156.3820044|16.2010752|2.1969249|99.5855559 unknown
InChI: InChI=1S/C12H15NO3/c1-9(14)13-11(12(15)16)8-7-10-5-3-2-4-6-10/h2-6,11,13,15H,7-8H2,1H3
charge 0 multiplicity 1
31 atoms
O  -2.694223 2.056506 -1.186395
O  -1.766852 2.99974 0.72345
O  -2.550049 -2.074075 1.257852
N  -2.482992 -0.424852 -0.371524
C  -0.321804 0.299086 0.735576
C  -1.852225 0.544703 0.534796
C  0.50794 0.417135 -0.568883
C  1.973089 0.078251 -0.333199
C  -2.08993 1.97966 0.083452
C  2.918963 1.095707 -0.046182
C  2.415982 -1.2698 -0.357106
C  -2.812466 -1.694782 0.074034
C  4.272235 0.77672 0.209297
C  3.767307 -1.593837 -0.102296
C  4.701372 -0.570331 0.182196
C  -3.506042 -2.595624 -0.942506
H  0.046068 1.023111 1.485657
H  -0.215185 -0.711898 1.166727
H  -2.317051 0.428747 1.534588
H  0.076523 -0.265731 -1.32607
H  0.423295 1.446922 -0.968318
H  -2.755481 -0.102813 -1.301662
H  2.592885 2.143363 -0.025044
H  1.697289 -2.069113 -0.578726
H  4.989864 1.576205 0.426452
H  4.09224 -2.64029 -0.127894
H  5.750352 -0.819414 0.378145
H  -4.484475 -2.906925 -0.537747
H  -3.660552 -2.115862 -1.92428
H  -2.906414 -3.511526 -1.082584
H  -2.813859 3.010822 -1.440804
