program: Gaussian 09
title: 000227941
version: EM64L-G09RevD.01
frameworkgroup: C1[X(C9H17NO3)]
method: RPBEPBE
basis: SDD
operation: Freq
keyword: #p
keyword: freq=noraman
keyword: PBEPBE/SDD
title: #p freq=noraman PBEPBE/SDD
converged: YES YES NO NO
title: Mulliken charges:
elementType: O O O N C C C C C C C C C H H H H H H H H H H H H H H H H H
charge: -0.404166 -0.238842 -0.280365 -0.382665 -0.384017 -0.345617 -0.358306 -0.134363 -0.358232 0.132653 -0.696335 0.240509 -0.787133 0.201768 0.227055 0.204694 0.212780 0.294540 0.188590 0.187886 0.197178 0.201586 0.324937 0.209762 0.208500 0.217189 0.262280 0.236668 0.235331 0.386135
chargesum: 0.00000
title: Mulliken charges with hydrogens summed into heavy atoms:
elementType: O O O N C C C C C C C C C
charge: -0.018030 -0.238842 -0.280365 -0.057729 0.044806 0.071857 0.018170 0.160177 0.040532 0.132653 -0.060884 0.240509 -0.052854
polarizability: 1.25823478e+02 -2.12738843e+00 1.20162102e+02 -8.42487506e+00 -1.02370915e+00 9.69663245e+01
1716.lowfreq: -73.0143 -4.0574 -0.0009 -0.0007 -0.0004 3.2160 6.7841 36.6029 41.7094
frequency: -72.9931 36.4952 41.6809 51.0120 61.1785 72.6895 90.0503 119.8617 123.8968 154.7913 179.9219 225.8162 228.7168 280.2877 331.3620 356.6802 407.6369 444.3609 503.8125 565.0647 588.8708 598.7084 601.8162 617.3016 701.0864 722.2741 751.9328 829.6213 866.9847 891.7053 918.3439 958.9576 972.8470 995.3941 1018.5349 1033.2043 1058.7113 1061.8003 1076.8087 1105.9404 1113.9568 1164.5980 1202.8972 1220.5020 1245.5663 1256.7591 1266.4228 1287.6851 1297.2566 1303.2215 1321.7360 1339.2984 1347.5708 1358.1226 1374.5575 1389.6796 1445.0610 1456.5813 1462.5062 1467.1728 1469.0622 1476.7509 1479.0823 1487.6410 1490.9618 1621.9057 1650.4079 2950.6683 2969.2340 2971.3488 2973.9138 2986.4275 2990.5299 2992.1750 3020.0403 3023.4490 3035.6867 3059.5890 3068.2886 3070.8852 3076.5267 3134.9795 3512.9677 3522.9351
redmass: 1.0675 3.0715 4.2405 2.0155 7.8226 3.9663 3.5319 2.9763 1.7222 4.2453 3.4286 3.5200 1.1446 6.1876 3.5264 3.4854 3.2833 3.0918 3.0192 2.0791 2.0379 1.4002 3.2710 2.6179 3.5544 1.0805 1.1724 1.3446 4.6352 2.0314 1.6499 4.0992 1.3782 1.8862 3.4357 1.6878 2.6197 2.2892 2.3891 2.3573 2.2609 2.5156 1.5282 1.2671 1.4100 1.4506 1.5746 1.0662 1.1685 1.3224 1.2542 2.2439 1.4674 1.6101 1.2608 1.2182 1.1824 1.0744 1.0744 1.0490 1.0781 1.0438 1.0744 1.0901 1.6930 6.5336 8.2656 1.0588 1.0570 1.0389 1.0608 1.0595 1.0379 1.0986 1.0967 1.0893 1.0991 1.1035 1.1010 1.0992 1.0982 1.0985 1.0642 1.0774
irintensity: 0.0279 0.0917 2.9386 1.0283 4.5234 4.6698 4.2730 3.7321 0.2442 5.4843 3.8748 0.9342 0.0355 2.0798 0.3805 6.1100 3.3783 17.4971 33.3678 7.5687 39.5144 193.2391 4.3300 28.4430 43.6929 11.8023 1.5349 6.9115 8.0223 4.1783 0.6312 10.4691 6.6037 1.9236 2.6747 9.6326 150.5236 90.3674 1.9770 5.0389 15.8991 3.0460 1.0420 15.1753 6.1849 9.0714 25.8320 1.0878 3.1116 8.9304 15.5197 122.7537 1.4055 2.2028 59.5382 11.0654 101.0940 1.5976 2.7203 20.0719 4.2458 11.0295 9.8521 29.5589 146.5557 227.9587 168.7488 14.4607 49.1524 28.5811 11.0417 60.4350 8.5366 3.7605 6.4724 12.4815 6.1306 35.2588 118.9306 52.3675 15.7070 8.2980 31.1500 37.7695
temp: 298.150 k
press: 1.00000 atm
elementType: 8 8 8 7 6 6 6 6 6 6 6 6 6 1 1 1 1 1 1 1 1 1 1 1 1 1 1 1 1 1
symmnumber: 1
zpe: 663944.0 jmol-1
zpe.correction: 0.252883 hartree
zpe.thermalcorrener: 0.268166 hartree
zpe.thermalcorrenthalpy: 0.269110 hartree
zpe.thermalcorrgfe: 0.208309 hartree
zpe.sumelectzpe: -632.559270 hartree
zpe.sumelectthermal: -632.543987 hartree
zpe.sumelectthermalent: -632.543042 hartree
zpe.sumelectthermalfe: -632.603844 hartree
dipole: 0.1053 -1.6113 -2.2042
dipole: 2.7323
quadrupole: -79.6010 -73.6227 -84.3437
quadrupole: -0.9413 0.2267 -8.9685
quadrupole: -0.4118 5.5664 -5.1546 -0.9413 0.2267 -8.9685
hfenergy: -632.8121526 hartree
pointgroup: C01 [X(C9H17N1O3)]
dipole: -0.0706387 0.623307 0.8729679 debye
polarizability: 124.35285|2.5433553|120.6640069|9.9553997|0.3052257|97.9350474 unknown
InChI: InChI=1S/C9H17NO3/c1-3-4-5-6-8(9(12)13)10-7(2)11/h8,10,12H,3-6H2,1-2H3
charge 0 multiplicity 1
30 atoms
O  1.633538 2.893111 -0.625482
O  2.654391 1.809128 1.156783
O  1.089555 -1.956706 -1.309984
N  1.39782 -0.566618 0.529911
C  -0.56498 1.007245 0.198628
C  -1.568174 -0.091674 -0.209298
C  -3.028466 0.303619 0.104932
C  0.912246 0.636364 -0.154025
C  -4.045938 -0.790648 -0.292021
C  1.835209 1.794933 0.208976
C  -5.506499 -0.392823 0.011079
C  1.498456 -1.790607 -0.12083
C  2.12958 -2.904504 0.712097
H  -0.639178 1.201737 1.288098
H  -0.809845 1.953036 -0.321857
H  -1.318662 -1.034228 0.315825
H  -1.460929 -0.305509 -1.290955
H  0.96882 0.44146 -1.241792
H  -3.280225 1.245449 -0.426563
H  -3.131185 0.521198 1.189198
H  -3.797559 -1.729853 0.242939
H  -3.937134 -1.012716 -1.372903
H  1.843745 -0.43049 1.44144
H  -5.789229 0.525683 -0.537346
H  -5.648515 -0.195233 1.090611
H  -6.21263 -1.19151 -0.28167
H  2.152334 -3.82599 0.112836
H  3.162742 -2.644292 1.007593
H  1.548219 -3.090513 1.633704
H  2.225892 3.641848 -0.342822
