program: Gaussian 09
title: 000227930
version: EM64L-G09RevD.01
frameworkgroup: C1[X(C9H8N2O2)]
method: RPBEPBE
basis: SDD
operation: Freq
keyword: #pfreq=noraman
keyword: PBEPBE/SDD
title: #p freq=noraman PBEPBE/SDD
converged: NO YES NO NO
title: Mulliken charges:
elementType: O O N N C C C C C C C C C H H H H H H H H
charge: -0.207129 -0.234870 -0.337564 -0.386738 -0.465016 0.190943 0.469119 0.237810 -0.348912 -0.341855 -0.221942 -0.222986 -0.242586 0.265257 0.263051 0.342024 0.275351 0.276401 0.229498 0.229570 0.230575
chargesum: 0.00000
title: Mulliken charges with hydrogens summed into heavy atoms:
elementType: O O N N C C C C C C C C C
charge: -0.207129 -0.234870 -0.337564 -0.044714 0.063292 0.190943 0.469119 0.237810 -0.073561 -0.065454 0.007556 0.006584 -0.012011
polarizability: 1.57596915e+02 -6.38791740e+00 1.20311957e+02 -1.31194596e+00 -7.32768981e+00 5.65080999e+01
1716.lowfreq: -10.4310 -7.6341 -6.5239 0.0007 0.0010 0.0010 42.6504 80.8410 116.8963
frequency: 42.6412 80.8378 116.8961 175.6276 196.1487 275.4633 291.7169 357.2960 402.6649 432.0637 477.7427 499.0537 575.4714 580.9913 599.7324 613.5042 683.4560 691.9108 712.8535 718.0207 769.5515 836.8688 914.7552 936.2321 970.3958 990.0733 992.8861 996.5776 1017.5573 1033.7166 1068.7052 1096.4185 1148.3952 1161.9111 1176.0253 1197.6227 1217.5362 1297.7302 1332.1688 1355.2062 1382.0013 1384.8622 1445.4768 1465.4065 1489.5218 1594.3815 1612.6843 1654.3480 1721.8900 2999.3936 3052.0674 3132.3900 3145.2759 3163.2891 3190.1560 3193.2449 3618.5595
redmass: 4.4933 4.9564 6.5187 6.2503 3.1680 5.3842 8.9647 5.4313 2.8489 9.1784 1.1061 3.1984 3.5257 4.8929 7.3244 6.3561 6.4925 1.9663 8.7722 6.6438 1.8248 1.2529 1.4578 6.2802 1.4039 5.7833 1.3371 1.8769 5.1607 2.2166 2.1407 1.6470 4.7965 1.0940 1.0487 1.1612 3.5706 1.9821 1.3167 4.1980 2.3943 3.9088 2.3142 1.1023 2.3231 6.3787 5.9199 10.9417 10.1445 1.0582 1.1048 1.0855 1.0909 1.0975 1.0944 1.0964 1.0802
irintensity: 0.2368 10.8510 3.3095 2.0167 11.4254 0.5771 9.6358 1.2984 0.6833 5.9477 146.8285 6.7365 4.8621 9.3813 31.1764 1.5936 11.4812 47.8138 8.6462 26.3941 69.4801 0.0415 5.9486 13.7839 0.0462 0.1566 0.7340 1.0467 11.1835 4.0699 75.0272 7.5606 133.5904 0.8695 0.3365 9.7413 82.5007 64.3399 2.3185 265.0875 12.6294 7.3862 17.9824 26.2951 90.0161 3.5563 20.0631 510.5816 153.4134 22.0594 8.7833 0.0813 20.1929 28.7233 1.9185 2.0819 73.2654
temp: 298.150 k
press: 1.00000 atm
elementType: 8 8 7 7 6 6 6 6 6 6 6 6 6 1 1 1 1 1 1 1 1
symmnumber: 1
zpe: 414382.7 jmol-1
zpe.correction: 0.157830 hartree
zpe.thermalcorrener: 0.168242 hartree
zpe.thermalcorrenthalpy: 0.169187 hartree
zpe.thermalcorrgfe: 0.121067 hartree
zpe.sumelectzpe: -606.820303 hartree
zpe.sumelectthermal: -606.809890 hartree
zpe.sumelectthermalent: -606.808946 hartree
zpe.sumelectthermalfe: -606.857066 hartree
dipole: -2.4652 0.0289 0.0250
dipole: 2.4655
quadrupole: -49.7033 -86.0164 -76.4801
quadrupole: 0.9891 0.1868 -6.4633
quadrupole: 21.0299 -15.2831 -5.7468 0.9891 0.1868 -6.4633
hfenergy: -606.9781329 hartree
pointgroup: C01 [X(C9H8N2O2)]
dipole: 0.9698768 0.011476 -0.0094369 debye
dipolederiv: -0.4772453 0.1559173 -0.0424058 -0.18698 -1.1322999 0.1447087 0.0487773 0.1239899 -0.3438201 -0.6587579 -0.1186038 0.0399415 -0.1330784 -1.1448319 0.1538217 -0.0071423 0.1344828 -0.3608876 -1.2456618 -0.0945819 0.0135846 0.0745329 -1.3568335 0.1662048 0.0091008 0.1605479 -0.149064 -1.1579743 -0.143826 0.0360078 -0.15733 -0.4819082 0.0055163 0.0532086 -0.0055764 -0.515655 -0.3082168 0.1389977 -0.0212363 0.2264657 0.3897452 -0.0090026 -0.066805 -0.017224 0.3307567 0.9468839 0.2453683 -0.0406704 0.5212172 1.6526233 -0.267239 -0.0131393 -0.2124772 0.2179236 1.0125141 0.0044085 0.0021196 0.0016845 0.0049097 0.0745178 0.0010826 0.0411466 0.0894542 1.6754824 -0.0690164 -0.0034214 -0.2341025 1.769538 -0.2899106 -0.0480432 -0.2212369 0.3240003 -0.164808 0.0708335 0.0127989 0.1031215 -0.0454525 0.0412146 -0.0138794 0.0089263 -0.1279237 -0.1697392 -0.0817569 -0.0130562 -0.113335 -0.0214809 0.0373353 0.0011836 0.0000283 -0.1265165 0.0017872 -0.0974053 -0.0275478 -0.0864086 0.0627469 0.0958692 -0.0509842 0.0738663 -0.1171642 0.01265 0.0942613 0.028705 0.0892912 0.0695654 0.0961755 0.0501816 0.0848554 -0.1176894 0.0528088 -0.004925 0.0011948 0.0066099 -0.0709585 0.0244663 0.0034066 0.0365493 -0.1497088 0.0708715 -0.0278053 0.0593778 -0.0289056 0.0216724 0.0316102 0.1057055 0.0659828 -0.0266174 0.0584253 -0.0436206 -0.0487491 -0.0488055 -0.0058446 -0.0350725 -0.0979402 -0.0719981 0.0038407 0.2346128 -0.0201443 0.0008656 -0.0324038 0.1480771 0.0364153 0.0124509 0.0335902 0.3840056 0.0964347 -0.0647384 -0.0290837 -0.0515907 0.0502541 -0.058827 -0.0314022 -0.0311407 0.1414383 0.1176357 0.0603929 0.0314406 0.0489143 0.0543188 -0.0579252 0.0441563 -0.0303571 0.1431119 0.0186894 0.0715473 0.0331405 0.0926022 -0.032105 -0.0817705 0.0408876 -0.0762336 0.1234442 0.0203827 -0.0740476 -0.032561 -0.0917863 -0.0348929 -0.081624 -0.0407101 -0.0772128 0.1229626 -0.1367751 -0.0012554 -0.0004451 0.0002869 0.1031568 -0.0264844 -0.0000954 -0.0205092 0.1541082 unknown
polarizability: 157.5989509|6.4101741|119.9386475|-1.1475723|8.7913978|56.8793738 unknown
InChI: InChI=1S/C9H8N2O2/c12-8-6-10-9(13)11(8)7-4-2-1-3-5-7/h1-5,10H,6H2
charge 0 multiplicity 1
21 atoms
O  1.226332 2.352101 -0.323326
O  1.187846 -2.344944 0.346081
N  0.783945 0.019356 0.001877
N  2.917148 -0.751534 0.098129
C  3.057394 0.688967 -0.100281
C  1.595731 1.16575 -0.159672
C  -0.658562 0.008707 0.003801
C  1.599288 -1.176256 0.171294
C  -1.368062 1.138353 0.484296
C  -1.360163 -1.123308 -0.481471
C  -2.778753 1.128992 0.473199
C  -2.770986 -1.119968 -0.475824
C  -3.487424 0.002867 -0.003167
H  3.569582 0.951327 -1.044497
H  3.580575 1.193351 0.733388
H  3.682187 -1.414113 0.200663
H  -0.826093 2.01622 0.841482
H  -0.811739 -1.998997 -0.834454
H  -3.32246 2.005736 0.841235
H  -3.309101 -1.99917 -0.846177
H  -4.582683 0.000264 -0.00598
