program: Gaussian 09
title: 000227912
version: EM64L-G09RevD.01
frameworkgroup: C1[X(C16H25NO)]
method: RPBEPBE
basis: SDD
operation: Freq
keyword: #p
keyword: freq=noraman
keyword: PBEPBE/SDD
title: #p freq=noraman PBEPBE/SDD
converged: YES YES NO NO
title: Mulliken charges:
elementType: O N C C C C C C C C C C C C C C C C H H H H H H H H H H H H H H H H H H H H H H H H H
charge: -0.290851 -0.174268 0.012864 -0.080265 0.134528 -0.706567 -0.710728 -0.683756 -0.672951 0.264499 -0.235542 0.556925 -0.340995 -0.405837 -0.479304 -0.400487 -0.694033 -0.688981 0.185299 0.249458 0.218452 0.203403 0.273320 0.206676 0.270573 0.210765 0.229622 0.216124 0.212623 0.217865 0.211353 0.219904 0.207930 0.235939 0.258079 0.234090 0.229913 0.211586 0.213295 0.225654 0.229033 0.211711 0.213082
chargesum: 0.00000
title: Mulliken charges with hydrogens summed into heavy atoms:
elementType: O N C C C C C C C C C C C C C C C C
charge: -0.290851 -0.174268 0.198163 0.169193 0.134528 -0.011392 -0.022714 -0.025386 -0.023829 0.264499 -0.027612 0.556925 -0.105056 -0.147758 -0.245214 -0.170574 -0.043498 -0.035155
polarizability: 2.51771286e+02 -3.69382872e+00 1.62317485e+02 -1.92868787e+00 -1.23775690e+01 1.49097421e+02
1716.lowfreq: -5.6941 -0.0007 -0.0003 0.0002 4.2990 13.6029 20.8665 41.0187 54.8608
frequency: 19.3917 40.9701 54.7898 59.0937 88.2470 98.6685 121.8706 154.4046 157.4653 184.0563 196.5379 205.9707 209.3111 219.7067 223.6776 228.0519 248.0400 258.0594 281.4786 295.4217 330.1005 331.0106 346.7627 377.4601 406.9706 444.9764 461.2973 492.9875 516.2596 519.0693 577.7544 587.1297 626.3955 631.8024 704.5984 748.4826 765.6013 825.9933 850.3577 855.6990 868.8512 890.5193 908.0507 916.5555 919.1632 922.2233 938.5369 943.6270 953.4695 965.1987 978.0349 1010.6912 1025.2619 1049.8519 1089.4394 1109.6674 1112.5997 1129.8378 1147.5736 1149.9073 1156.7832 1164.9526 1183.6523 1194.1147 1208.4458 1221.8507 1292.2163 1308.1462 1312.7897 1316.2683 1322.4729 1326.3770 1363.6236 1367.6430 1378.2340 1378.7324 1381.6961 1384.8779 1395.4595 1398.6051 1407.3267 1415.9910 1453.5064 1463.9095 1466.4705 1466.9196 1468.0403 1470.2333 1478.1246 1479.8863 1484.5101 1484.8139 1487.3998 1500.4849 1502.6391 1541.3457 1576.2184 1616.7513 2975.2951 2977.6782 2979.7433 2980.4494 2983.9412 2984.7401 2987.9312 3015.1204 3048.7707 3068.5258 3072.4979 3074.7797 3075.1521 3077.8930 3078.9215 3082.6104 3083.4003 3086.1910 3091.5063 3111.8124 3114.6054 3117.1513 3123.7042 3141.3082 3155.9822
redmass: 2.9930 3.5361 3.5896 3.6449 2.8891 2.7721 3.4118 3.1488 2.2911 3.2102 1.1667 1.6384 1.2682 1.6870 1.5178 1.3423 1.2121 1.1223 2.6713 3.1843 2.9713 2.9593 3.6580 2.4882 2.8534 3.1868 3.2211 2.7068 4.2677 3.5692 2.7117 2.9645 3.1587 6.6822 5.2027 4.0125 3.9736 2.9582 1.5319 1.4223 2.4857 2.5577 2.3467 1.3464 1.1861 1.2049 1.3242 1.4419 1.4621 1.3554 1.3813 3.0134 1.9655 1.5983 2.1006 2.1886 1.7271 2.3778 2.3374 2.2421 1.7451 2.1962 2.2077 1.2424 2.6632 1.9241 1.5553 1.3217 2.2725 1.3328 1.4743 1.6676 1.2471 1.2076 1.2257 1.2000 3.2729 1.2405 1.2290 1.2317 2.5049 1.8021 1.0448 1.0567 1.0451 1.0764 1.0509 1.0535 1.0494 1.0481 1.0799 1.1242 1.0569 1.1557 1.9449 5.4422 6.7030 6.3114 1.0349 1.0391 1.0800 1.0353 1.0360 1.0364 1.0378 1.0821 1.0865 1.1000 1.0998 1.0993 1.0992 1.1004 1.0990 1.0997 1.1001 1.0976 1.0990 1.0994 1.0874 1.0989 1.0880 1.0952 1.0956
irintensity: 0.4639 0.6395 1.0655 0.2842 0.2697 1.3285 0.4520 0.9546 0.0845 0.5981 0.2266 0.5092 0.5801 0.8221 0.5458 0.2447 0.2576 0.2512 1.5939 4.0053 1.6758 1.4914 7.1930 0.1496 0.0224 0.9586 2.4170 1.0751 8.4531 14.4385 10.4236 13.3600 1.8073 1.1294 25.7515 3.3193 3.4552 21.3116 22.0930 15.4208 8.2008 2.7103 9.7626 2.9838 3.0167 3.8783 0.0883 0.1393 0.0733 0.1340 1.4809 24.3884 19.1079 38.2302 14.2203 6.2771 13.4194 1.2229 23.8165 19.8339 1.2822 47.8864 15.7321 10.9287 24.2796 2.8156 15.6000 3.3589 276.5813 4.3032 3.5107 32.9343 8.7354 30.4716 32.6220 16.5971 3.8657 53.6307 5.8916 8.2845 6.3226 87.8209 0.4687 8.2698 2.4513 26.6414 6.1233 5.5854 12.0047 16.5298 1.2898 13.7966 7.1370 29.6871 1.1730 153.7838 17.8623 21.3150 31.3112 40.1944 18.6120 18.3841 17.6371 45.4331 37.3750 31.0766 1.8514 0.0448 10.8501 5.8730 108.3074 24.4604 77.6446 38.6126 29.3589 54.4534 46.6947 1.9160 14.1197 20.1883 19.3360 19.8139 4.8055
temp: 298.150 k
press: 1.00000 atm
elementType: 8 7 6 6 6 6 6 6 6 6 6 6 6 6 6 6 6 6 1 1 1 1 1 1 1 1 1 1 1 1 1 1 1 1 1 1 1 1 1 1 1 1 1
symmnumber: 1
zpe: 981453.5 jmol-1
zpe.correction: 0.373816 hartree
zpe.thermalcorrener: 0.394323 hartree
zpe.thermalcorrenthalpy: 0.395268 hartree
zpe.thermalcorrgfe: 0.324796 hartree
zpe.sumelectzpe: -753.295974 hartree
zpe.sumelectthermal: -753.275466 hartree
zpe.sumelectthermalent: -753.274522 hartree
zpe.sumelectthermalfe: -753.344994 hartree
dipole: -0.4502 4.0870 0.0150
dipole: 4.1117
quadrupole: -96.9090 -117.1998 -108.8887
quadrupole: 5.7298 -0.4631 -3.0664
quadrupole: 10.7569 -9.5340 -1.2229 5.7298 -0.4631 -3.0664
hfenergy: -753.6697895 hartree
pointgroup: C01 [X(C16H25N1O1)]
dipole: 0.187974 1.5320055 0.4842712 debye
polarizability: 251.8321153|3.3026508|153.8569295|-0.3720333|13.9303977|157.497148 unknown
InChI: InChI=1S/C16H25NO/c1-11(2)14-7-9-15(10-8-14)16(18)17(12(3)4)13(5)6/h7-13H,1-6H3
charge 0 multiplicity 1
43 atoms
O  -1.555517 -1.898089 -0.840817
N  -2.27559 0.177817 -0.041723
C  -3.712511 -0.266906 -0.06469
C  -2.012173 1.63479 0.183764
C  -1.280621 -0.734667 -0.387678
C  -4.205058 -0.630154 -1.487363
C  -3.963834 -1.409327 0.947095
C  -2.660747 2.510103 -0.91791
C  -2.444885 2.090336 1.597624
C  0.174632 -0.35941 -0.202716
C  4.496212 0.29117 0.295146
C  2.992663 0.066834 0.116593
C  0.697717 0.138656 1.016785
C  1.079296 -0.667553 -1.251285
C  2.087005 0.34108 1.171603
C  2.461222 -0.443339 -1.098783
C  5.054281 1.301862 -0.741885
C  5.278849 -1.048655 0.236248
H  -4.290562 0.612198 0.277489
H  -0.920689 1.765168 0.101549
H  -4.040937 0.204998 -2.191229
H  -5.288766 -0.850255 -1.459191
H  -3.668769 -1.51648 -1.859705
H  -5.042422 -1.651022 0.975271
H  -3.407976 -2.313884 0.653584
H  -3.648789 -1.111158 1.963557
H  -2.318743 2.197035 -1.920041
H  -2.373878 3.567144 -0.768352
H  -3.764443 2.457025 -0.893914
H  -2.158074 3.145586 1.758131
H  -3.539407 2.017806 1.734186
H  -1.962697 1.476978 2.379184
H  4.651257 0.725383 1.303742
H  0.024725 0.340031 1.858296
H  0.682461 -1.101486 -2.175161
H  2.474549 0.712671 2.128446
H  3.135332 -0.679043 -1.93107
H  4.942161 0.91722 -1.772616
H  6.130874 1.483114 -0.565751
H  4.52466 2.269793 -0.682866
H  4.909742 -1.760688 0.996018
H  6.356899 -0.877278 0.414146
H  5.171053 -1.5277 -0.754614
