program: Gaussian 09
title: 000227911
version: EM64L-G09RevD.01
frameworkgroup: C1[X(C16H25NO)]
method: RPBEPBE
basis: SDD
operation: Freq
keyword: #p
keyword: freq=noraman
keyword: PBEPBE/SDD
title: #p freq=noraman PBEPBE/SDD
converged: YES YES NO NO
title: Mulliken charges:
elementType: O N C C C C C C C C C C C C C C C C H H H H H H H H H H H H H H H H H H H H H H H H H
charge: -0.277601 -0.127389 -0.413793 -0.369563 -0.329349 -0.345993 -0.336552 -0.342471 0.089649 0.296737 -0.693812 -0.697918 -0.375560 -0.382847 0.442163 -0.391464 -0.384041 -0.806685 0.205404 0.249911 0.195304 0.250786 0.193008 0.207327 0.184196 0.232681 0.199530 0.190901 0.205006 0.187940 0.211318 0.217494 0.214991 0.208258 0.215924 0.217364 0.249332 0.258564 0.231396 0.231038 0.224301 0.238901 0.225613
chargesum: 0.00000
title: Mulliken charges with hydrogens summed into heavy atoms:
elementType: O N C C C C C C C C C C C C C C C C
charge: -0.277601 -0.127389 0.041522 0.076527 0.070986 0.070885 0.053878 0.050476 0.089649 0.296737 -0.050009 -0.056371 -0.126228 -0.124283 0.442163 -0.160068 -0.153003 -0.117871
polarizability: 2.38988407e+02 6.60242522e+00 1.56297412e+02 3.32072214e+00 -2.57421647e+00 1.61884782e+02
1716.lowfreq: -0.0009 -0.0009 -0.0007 5.4872 7.2439 7.7911 10.4708 18.8354 26.6721
frequency: 9.1085 18.4784 26.5145 36.3044 55.4020 65.5960 74.4504 79.1715 92.0642 109.0430 123.0352 144.4290 171.4435 205.1686 227.6383 229.8122 240.4258 263.0097 293.7539 304.6456 343.7517 374.1145 397.6052 400.0423 414.9827 456.6622 515.8040 562.1596 587.2980 632.2423 691.2217 703.3208 735.5496 737.2938 744.4478 789.4606 791.8886 794.3383 836.4121 856.1995 893.4930 901.0173 907.4819 926.8688 947.3595 961.9765 977.2242 988.1023 1011.1136 1013.2657 1022.9899 1047.1619 1069.1431 1074.0983 1093.2739 1099.9597 1111.2586 1114.6336 1121.9746 1187.0358 1192.7947 1199.3925 1223.1622 1231.8841 1248.2853 1269.0549 1270.2407 1286.4570 1290.1275 1294.7922 1305.5647 1313.8964 1344.0567 1347.5192 1361.2120 1363.1516 1366.9928 1390.0861 1392.3381 1397.7888 1402.3142 1406.8472 1447.3489 1468.2179 1469.4236 1470.4926 1472.1083 1473.0214 1476.6583 1477.0463 1478.1088 1480.5647 1488.3665 1489.8412 1504.8438 1546.7787 1578.9427 1620.6207 2964.1024 2964.8402 2973.3431 2974.5990 2974.9769 2975.6133 2976.7423 2987.6040 3001.6224 3007.1735 3011.0369 3038.7696 3040.7451 3057.0153 3067.6819 3071.8086 3072.2261 3074.7003 3074.9918 3085.3112 3090.8184 3115.1093 3123.1445 3139.0030 3156.0662
redmass: 1.0185 3.4297 4.0468 4.1006 3.5298 3.4624 2.3989 1.6115 2.4576 2.2417 2.3900 3.3663 3.8240 2.9899 2.0217 1.4002 1.2138 3.7338 3.5911 4.1018 2.7380 2.7961 3.3278 2.7819 3.1781 3.0600 4.5355 3.3976 4.7775 6.7807 3.8124 5.7137 1.1152 1.1012 2.8184 1.2490 2.6729 1.4717 1.6143 1.2587 2.1348 1.7419 1.8874 1.2358 1.6056 1.3433 1.3860 1.4063 3.9483 3.1755 3.4992 1.5732 2.5349 2.5024 1.9108 1.9778 2.2604 2.3686 1.3181 1.7875 1.3354 2.1605 2.9449 1.5748 1.6963 1.2983 1.2732 1.2579 1.1041 1.1600 1.2939 1.2719 1.3809 1.4833 1.4820 3.6174 1.4168 1.2194 1.2152 1.2226 2.9795 2.4574 1.1409 1.0776 1.0983 1.0936 1.0944 1.0540 1.0639 1.0420 1.0482 1.0838 1.0842 1.0932 2.7271 6.0551 6.1960 6.3663 1.0590 1.0590 1.0496 1.0496 1.0422 1.0386 1.0547 1.0678 1.0616 1.0985 1.0951 1.1013 1.0998 1.0951 1.1028 1.1004 1.1009 1.0995 1.1017 1.0998 1.0959 1.0871 1.0888 1.0964 1.0959
irintensity: 0.5223 0.5709 0.5514 0.8998 0.0418 2.0303 1.1776 0.1730 1.4069 0.1628 0.1997 0.1734 0.5121 0.7652 0.2037 0.2136 0.4398 1.0107 5.1521 0.5659 1.9726 10.0267 1.5327 0.0894 2.0546 16.8988 3.9476 11.5267 7.1760 1.2826 1.2103 13.0536 8.6350 15.3573 11.6237 0.8400 2.4093 0.8566 47.3560 1.3596 2.3594 10.3194 3.2983 4.3493 19.5680 2.2225 1.3855 0.2251 4.7163 6.1123 0.9976 23.7636 0.5771 0.8202 45.3112 22.4827 9.4499 16.4484 10.9400 6.8964 8.6354 10.4471 2.8564 25.9324 23.9372 4.2408 0.7298 54.2576 14.3328 20.4957 16.9110 19.5998 1.6825 2.1103 13.2291 1.9238 6.8922 12.0017 8.7226 10.6821 22.0315 117.2292 25.3081 0.3880 6.6931 12.2085 5.5340 11.9404 7.6930 12.5922 10.3926 5.3738 17.2618 14.9531 6.7902 201.7134 21.2318 20.6316 24.7757 19.5417 23.7709 42.4147 28.0784 37.9905 16.5818 65.7113 45.3832 1.6129 11.2842 31.8816 8.8277 21.7158 5.2158 64.6482 56.3794 37.8921 100.1506 18.0013 38.2201 11.9965 19.8063 19.2255 5.8337
temp: 298.150 k
press: 1.00000 atm
elementType: 8 7 6 6 6 6 6 6 6 6 6 6 6 6 6 6 6 6 1 1 1 1 1 1 1 1 1 1 1 1 1 1 1 1 1 1 1 1 1 1 1 1 1
symmnumber: 1
zpe: 983707.8 jmol-1
zpe.correction: 0.374675 hartree
zpe.thermalcorrener: 0.395592 hartree
zpe.thermalcorrenthalpy: 0.396536 hartree
zpe.thermalcorrgfe: 0.320412 hartree
zpe.sumelectzpe: -753.294689 hartree
zpe.sumelectthermal: -753.273772 hartree
zpe.sumelectthermalent: -753.272828 hartree
zpe.sumelectthermalfe: -753.348952 hartree
dipole: -0.7685 3.0254 -2.6966
dipole: 4.1250
quadrupole: -95.9053 -115.8797 -111.0272
quadrupole: 4.1912 -0.9758 5.1546
quadrupole: 11.6988 -8.2756 -3.4231 4.1912 -0.9758 5.1546
hfenergy: -753.669364 hartree
pointgroup: C01 [X(C16H25N1O1)]
dipole: -0.4273251 1.1272899 -1.0864687 debye
polarizability: 236.510092|15.5798723|158.6579424|3.5598629|-2.0622806|162.002567 unknown
InChI: InChI=1S/C16H25NO/c1-4-6-12-17(13-7-5-2)16(18)15-10-8-14(3)9-11-15/h8-11H,4-7,12-13H2,1-3H3
charge 0 multiplicity 1
43 atoms
O  0.8061 -1.408541 1.70348
N  1.118711 0.293856 0.147493
C  0.60027 1.427867 -0.653612
C  2.562626 0.317862 0.49644
C  0.403435 2.720955 0.175645
C  3.386582 -0.675931 -0.353552
C  -0.039206 3.911903 -0.704821
C  4.886254 -0.657621 0.018974
C  0.328215 -0.660807 0.784618
C  -1.108689 -0.832069 0.352226
C  -0.248239 5.207512 0.108244
C  5.720452 -1.640597 -0.830475
C  -1.475462 -1.050077 -1.000592
C  -2.111717 -0.915286 1.349771
C  -3.83127 -1.377816 -0.354389
C  -2.816785 -1.322558 -1.344823
C  -3.45368 -1.167642 0.998078
C  -5.270028 -1.693205 -0.724803
H  1.311033 1.621476 -1.481964
H  -0.362473 1.147425 -1.108338
H  2.937824 1.347706 0.348849
H  2.668057 0.057868 1.565388
H  1.345057 2.979769 0.70049
H  -0.356038 2.531493 0.959975
H  3.266569 -0.434092 -1.42964
H  2.976896 -1.692251 -0.199834
H  -0.979391 3.649312 -1.231405
H  0.721435 4.087891 -1.493322
H  4.995901 -0.910986 1.092767
H  5.287039 0.370093 -0.103398
H  0.68566 5.511587 0.617336
H  -0.567884 6.044049 -0.539729
H  -1.022499 5.066655 0.885456
H  5.656539 -1.389641 -1.906249
H  6.787305 -1.620982 -0.541323
H  5.3548 -2.67692 -0.705702
H  -0.70591 -1.038814 -1.781822
H  -1.823697 -0.794481 2.399419
H  -3.078964 -1.501232 -2.394852
H  -4.218569 -1.214176 1.782884
H  -5.512794 -1.344933 -1.744183
H  -5.455619 -2.784758 -0.697648
H  -5.981445 -1.223262 -0.023058
