program: Gaussian 09
title: 000227901
version: EM64L-G09RevD.01
frameworkgroup: C1[X(C15H22O2)]
method: RPBEPBE
basis: SDD
operation: Freq
keyword: #pfreq=noraman
keyword: PBEPBE/SDD
title: #p freq=noraman PBEPBE/SDD
converged: NO YES NO NO
title: Mulliken charges:
elementType: O O C C C C C C C C C C C C C C C H H H H H H H H H H H H H H H H H H H H H H
charge: -0.264234 -0.246323 -0.135118 -0.388683 -0.388669 0.219821 -0.398916 -0.264754 -0.558474 -0.699271 -0.699299 0.501145 -0.408735 -0.409381 -0.227388 -0.227218 -0.242438 0.225356 0.202589 0.221464 0.221525 0.202531 0.227442 0.227408 0.223152 0.223278 0.207064 0.206939 0.226607 0.216434 0.212391 0.226675 0.216429 0.212330 0.231166 0.231201 0.224054 0.224055 0.227845
chargesum: 0.00000
title: Mulliken charges with hydrogens summed into heavy atoms:
elementType: O O C C C C C C C C C C C C C C C
charge: -0.264234 -0.246323 0.090238 0.035370 0.035387 0.219821 0.055933 0.181676 -0.144471 -0.043839 -0.043864 0.501145 -0.177569 -0.178180 -0.003334 -0.003162 -0.014593
polarizability: 2.07652835e+02 1.71813710e-02 1.61915655e+02 1.96449223e+01 -7.27387365e-02 1.26793335e+02
1716.lowfreq: -20.2856 -4.5945 0.0004 0.0006 0.0008 5.0062 6.8083 13.9930 29.5160
frequency: -18.5122 10.8448 29.4928 40.1200 57.4024 74.8175 80.5077 95.6230 107.1132 136.6744 139.3289 187.8270 211.4432 214.9894 241.5787 245.6571 304.2670 333.3491 356.0125 381.4195 402.8017 414.1529 460.1716 513.8886 581.4768 617.9884 633.3021 703.3316 704.1882 757.8366 760.3352 775.1574 788.5759 805.6462 847.3485 850.3322 854.9829 879.2483 915.8652 924.9929 944.0077 975.0084 990.1173 992.9544 1017.8198 1025.2481 1031.5050 1042.2577 1047.4430 1061.7074 1085.2750 1099.0650 1100.9595 1102.4122 1118.1380 1155.6703 1163.0956 1171.7818 1186.5142 1217.2673 1243.3982 1255.5454 1257.2513 1263.4374 1273.2204 1277.8503 1325.3340 1328.2456 1329.6127 1333.8783 1355.0554 1377.3671 1383.5025 1394.4084 1394.8009 1440.7267 1456.8147 1465.7435 1469.7307 1475.4614 1476.7989 1477.3226 1481.4453 1482.0038 1484.7409 1489.7472 1594.1699 1614.9867 1630.1839 2977.8860 2977.8916 2978.7101 2981.3641 2985.8948 2994.0075 3006.6249 3012.8329 3027.8529 3034.7823 3045.3000 3048.5446 3075.3650 3076.9415 3076.9812 3078.2294 3078.9364 3113.9624 3114.1970 3131.3391 3143.1777 3162.2059
redmass: 3.6453 3.5389 4.6751 4.4095 4.1035 2.1085 2.0981 1.9192 4.8487 3.2955 2.0729 1.4123 2.4115 4.4236 2.4170 1.4797 3.0558 2.3274 3.9558 3.6642 2.8126 2.7166 4.2978 3.2826 4.6043 6.3539 2.5715 3.6942 1.7389 1.9837 1.0908 1.3127 2.2910 3.9677 1.2622 1.5970 1.2584 3.0610 1.4570 2.1493 3.3571 1.3886 6.2543 1.3178 1.7078 2.6301 3.0229 1.5779 1.4904 3.1307 3.3394 1.9616 1.7129 2.3476 2.2114 2.4600 1.1888 1.0515 1.1138 2.4601 1.2925 1.2813 1.2643 1.3204 1.1505 1.1046 1.4535 1.2504 1.3571 1.3778 1.4663 1.6029 7.6915 1.2087 1.2196 2.1774 1.0769 1.0790 1.0890 1.1154 1.0492 1.0510 1.0483 1.0539 2.2004 1.0986 6.0561 6.1984 9.0359 1.0592 1.0364 1.0355 1.0594 1.0602 1.0580 1.0588 1.0859 1.1014 1.1017 1.0994 1.1055 1.1010 1.0997 1.0994 1.1003 1.1066 1.0883 1.0861 1.0905 1.0957 1.1015
irintensity: 0.0081 0.0051 1.4334 0.1432 0.3868 0.0085 0.0762 0.2101 1.3194 0.0363 0.1329 1.7444 5.4324 1.3241 2.7726 1.0488 4.7208 0.1525 11.3186 0.1815 0.0001 1.7610 0.3324 22.7548 4.2146 0.0722 1.0604 3.9243 54.1209 30.9493 2.4679 1.1366 25.8696 7.4993 0.0095 6.2303 0.0061 5.2861 5.0618 2.0196 56.5800 0.0126 0.0501 0.1302 1.4874 5.3922 4.6311 4.7672 10.7248 2.5807 88.1219 0.0142 7.9484 183.0869 118.5331 66.0006 3.2139 0.2159 0.2745 0.0488 0.2766 21.0976 0.6226 12.2590 0.1408 0.3015 2.1519 0.0904 10.7070 2.8790 34.5006 3.3237 0.0531 15.4191 8.4334 6.8125 0.5932 19.5058 0.3162 0.6383 1.4643 23.7142 7.3742 22.5216 16.9378 17.1950 1.4021 15.0636 148.6202 24.8742 44.2886 16.9429 0.5347 63.9580 10.6820 35.5274 9.3318 9.8736 0.0710 9.4975 0.4655 2.5719 42.2993 89.8447 99.6500 38.9652 6.1990 12.9589 9.8756 45.0888 23.9510
temp: 298.150 k
press: 1.00000 atm
elementType: 8 8 6 6 6 6 6 6 6 6 6 6 6 6 6 6 6 1 1 1 1 1 1 1 1 1 1 1 1 1 1 1 1 1 1 1 1 1 1
symmnumber: 1
zpe: 878801.6 jmol-1
zpe.correction: 0.334718 hartree
zpe.thermalcorrener: 0.352838 hartree
zpe.thermalcorrenthalpy: 0.353782 hartree
zpe.thermalcorrgfe: 0.285291 hartree
zpe.sumelectzpe: -733.942769 hartree
zpe.sumelectthermal: -733.924649 hartree
zpe.sumelectthermalent: -733.923705 hartree
zpe.sumelectthermalfe: -733.992196 hartree
dipole: -0.7225 0.0074 -1.4478
dipole: 1.6181
quadrupole: -99.6949 -96.7292 -109.3143
quadrupole: 0.0542 -5.3567 0.0054
quadrupole: 2.2179 5.1836 -7.4015 0.0542 -5.3567 0.0054
hfenergy: -734.2774868 hartree
pointgroup: C01 [X(C15H22O2)]
dipole: -0.2889378 -0.0016134 -0.5672702 debye
polarizability: 207.9713288|0.1190901|161.9113627|18.9749508|-0.4037943|126.4791338 unknown
InChI: InChI=1S/C15H22O2/c1-3-14(4-2)15(16)17-12-8-11-13-9-6-5-7-10-13/h5-7,9-10,14H,3-4,8,11-12H2,1-2H3
charge 0 multiplicity 1
39 atoms
O  1.621765 -0.002644 -0.025884
O  3.188209 0.005379 1.697711
C  3.960884 -0.005176 -0.653415
C  4.83586 1.278616 -0.566442
C  4.838876 -1.285767 -0.551609
C  2.930941 0.000328 0.469682
C  -0.79479 0.000623 0.243655
C  0.534457 0.002934 0.998424
C  -1.99964 0.008672 1.227247
C  4.043389 2.58924 -0.755694
C  4.049562 -2.600215 -0.726986
C  -3.335398 0.008419 0.497486
C  -3.957678 1.226853 0.121805
C  -3.96918 -1.210318 0.142666
C  -5.178716 1.229604 -0.589645
C  -5.190296 -1.213623 -0.568708
C  -5.799654 0.00782 -0.938285
H  3.412181 -0.011343 -1.614251
H  5.621749 1.202821 -1.343527
H  5.348865 1.28591 0.414716
H  5.351104 -1.280997 0.429973
H  5.625215 -1.216768 -1.328864
H  -0.850591 -0.891467 -0.407437
H  -0.847463 0.885255 -0.417795
H  0.654329 0.900169 1.634549
H  0.652862 -0.888392 1.643049
H  -1.929208 -0.877634 1.888268
H  -1.924578 0.901681 1.878719
H  3.288389 2.721527 0.041038
H  4.717855 3.464042 -0.724104
H  3.514669 2.601284 -1.726884
H  3.293712 -2.725021 0.07015
H  4.725849 -3.473142 -0.684468
H  3.522285 -2.624513 -1.698739
H  -3.48485 2.179025 0.394417
H  -3.505414 -2.162135 0.43158
H  -5.646939 2.180822 -0.867433
H  -5.667555 -2.164973 -0.830201
H  -6.74796 0.007599 -1.487264
