program: Gaussian 09
title: 000227897
version: EM64L-G09RevD.01
frameworkgroup: C1[X(C15H14O3)]
method: RPBEPBE
basis: SDD
operation: Freq
keyword: #pfreq=noraman
keyword: PBEPBE/SDD
title: #p freq=noraman PBEPBE/SDD
converged: NO NO NO NO
title: Mulliken charges:
elementType: O O O C C C C C C C C C C C C C C C H H H H H H H H H H H H H H
charge: -0.244929 -0.240250 -0.187476 0.303685 -0.534031 -0.551987 0.209053 -0.735867 -0.724480 0.004330 0.079075 0.326809 0.064322 0.042962 -0.384256 -0.355329 -0.226599 -0.235435 0.256789 0.251483 0.238970 0.250890 0.225490 0.220340 0.212744 0.232748 0.215760 0.221336 0.314879 0.273653 0.235838 0.239482
chargesum: 0.00000
title: Mulliken charges with hydrogens summed into heavy atoms:
elementType: O O O C C C C C C C C C C C C C C C
charge: -0.244929 -0.240250 -0.187476 0.303685 -0.025759 -0.062127 0.209053 -0.077293 -0.054636 0.004330 0.079075 0.326809 0.064322 0.042962 -0.069377 -0.081676 0.009239 0.004047
polarizability: 2.33656888e+02 -5.66034073e+00 1.91519027e+02 8.38766222e+00 -1.22654380e+00 9.23461434e+01
1716.lowfreq: -7.5736 0.0004 0.0005 0.0006 4.1519 5.9167 42.1279 54.3393 95.9853
frequency: 42.1172 54.3140 95.9807 119.8423 162.5769 185.6882 193.6016 196.8552 233.3341 263.4610 279.7923 302.7593 316.3525 333.7289 363.1634 376.4766 418.0305 427.5282 462.4877 491.7855 501.3692 515.6763 528.4686 582.0055 624.8683 652.5827 658.1492 671.1322 688.5205 739.9072 775.6006 796.6082 809.5532 883.9056 897.4642 917.1423 920.0481 929.4442 937.9145 940.7257 993.5365 994.4510 1008.3189 1017.0990 1022.2280 1049.2089 1102.7351 1125.1133 1141.2961 1151.9243 1177.1681 1194.1914 1216.0240 1230.9290 1262.8922 1280.3398 1289.2424 1295.5656 1330.8786 1358.1087 1379.6592 1392.1449 1398.5881 1431.6156 1436.3376 1442.4144 1463.8339 1469.3369 1480.4421 1481.6174 1487.0591 1552.5136 1566.0547 1587.6177 1613.6225 1686.4552 2960.7495 2962.2503 2971.7681 2981.0625 3041.5830 3065.0101 3067.6539 3073.6444 3077.9808 3081.1748 3137.5660 3152.9604 3170.8637 3188.3657
redmass: 5.6316 3.5881 4.7671 4.0818 4.7939 2.1771 6.7409 1.2327 1.2878 2.4116 2.8387 5.1650 4.4342 5.0777 2.7036 2.8982 2.6366 3.6582 5.4344 3.8195 6.7396 4.9290 5.3031 4.3165 5.2518 6.3919 4.0729 4.7535 5.6360 6.2528 3.1418 1.6571 3.4430 1.9068 3.9375 1.7430 2.6449 2.0216 1.9547 1.7011 1.9284 1.4925 1.9192 2.3922 1.3265 2.1538 2.1675 1.6252 1.7435 2.1292 1.1579 2.1359 2.3236 3.1379 2.6678 1.4939 1.8745 1.8481 2.3135 3.1148 1.2017 10.2390 1.2085 1.1933 1.7075 1.2193 1.0497 1.0618 2.6645 1.0865 1.0616 7.0826 8.5417 8.0075 6.5171 12.7865 1.0659 1.0647 1.0359 1.0365 1.0935 1.0955 1.0984 1.0997 1.0991 1.0990 1.0871 1.0912 1.0987 1.0954
irintensity: 5.0871 0.9249 1.4294 1.3286 0.6334 1.1994 0.4777 0.5155 1.0766 0.8030 1.2447 6.8485 0.0658 1.3858 2.0587 1.7653 0.1333 0.3316 3.0151 2.7228 5.4664 9.4672 4.6674 2.7866 5.5991 6.1957 0.5260 26.9584 4.4615 40.5575 26.4534 40.7876 3.9936 16.7268 137.1080 2.4089 4.0130 6.4254 46.2276 18.7747 1.4217 3.6112 17.5195 19.7034 2.3759 8.4402 3.7533 4.4999 43.2636 5.8201 7.0023 26.5205 26.5140 51.4738 1.2697 4.2248 7.8092 4.0950 27.1697 197.2840 19.3898 12.9229 16.1505 12.9472 2.7320 15.4814 2.8514 12.9076 114.1820 6.2552 10.1440 25.7150 96.7116 87.3656 85.3974 431.1749 15.0508 11.7044 39.1676 17.6437 5.3192 7.5127 27.8491 11.3635 40.5586 54.5392 6.8840 6.8351 14.1791 21.4143
temp: 298.150 k
press: 1.00000 atm
elementType: 8 8 8 6 6 6 6 6 6 6 6 6 6 6 6 6 6 6 1 1 1 1 1 1 1 1 1 1 1 1 1 1
symmnumber: 1
zpe: 659944.8 jmol-1
zpe.correction: 0.251360 hartree
zpe.thermalcorrener: 0.266683 hartree
zpe.thermalcorrenthalpy: 0.267628 hartree
zpe.thermalcorrgfe: 0.209393 hartree
zpe.sumelectzpe: -804.408720 hartree
zpe.sumelectthermal: -804.393396 hartree
zpe.sumelectthermalent: -804.392452 hartree
zpe.sumelectthermalfe: -804.450686 hartree
dipole: -2.0424 -1.1163 -0.1670
dipole: 2.3336
quadrupole: -85.7989 -123.8913 -104.8243
quadrupole: -12.6386 1.6865 -0.3205
quadrupole: 19.0393 -19.0532 0.0139 -12.6386 1.6865 -0.3205
hfenergy: -804.6600796 hartree
pointgroup: C01 [X(C15H14O3)]
dipole: -0.8083683 -0.4300926 -0.0667288 debye
polarizability: 233.512077|-6.1386236|191.6537363|8.4732323|-1.2257995|92.3562448 unknown
InChI: InChI=1S/C15H14O3/c1-15(2)7-11(16)13-9-5-3-4-6-10(9)14(17)18-12(13)8-15/h3-6H,7-8H2,1-2H3
charge 0 multiplicity 1
32 atoms
O  0.030651 2.035497 -0.150907
O  -0.927242 -2.721948 -0.182887
O  2.100618 3.027604 -0.019358
C  -3.199751 0.173166 0.115638
C  -2.232502 1.300851 -0.335916
C  -2.720981 -1.139627 -0.561338
C  -0.781402 0.912679 -0.21912
C  -4.636578 0.510613 -0.350905
C  -3.185069 0.025391 1.660266
C  -0.275031 -0.381656 -0.18608
C  -1.258067 -1.49838 -0.286431
C  1.180023 -0.572846 -0.054835
C  2.029713 0.584928 0.003872
C  1.488176 1.947438 -0.052264
C  1.803538 -1.853904 0.009996
C  3.439904 0.455893 0.121714
C  3.200888 -1.96668 0.126004
C  4.028899 -0.815843 0.1826
H  -2.393651 2.226093 0.247884
H  -2.43623 1.563116 -1.395845
H  -2.836784 -1.042955 -1.662568
H  -3.334137 -2.002252 -0.247168
H  -5.345367 -0.276094 -0.034321
H  -4.978692 1.467538 0.085724
H  -4.694221 0.59785 -1.452175
H  -2.174351 -0.191625 2.049756
H  -3.542958 0.953827 2.142031
H  -3.850451 -0.799247 1.974063
H  1.16919 -2.741107 -0.028565
H  4.041889 1.369328 0.162391
H  3.652475 -2.963828 0.173728
H  5.114999 -0.918122 0.272916
