program: Gaussian 09
title: 000227895
version: EM64L-G09RevD.01
frameworkgroup: C1[X(C14H22O2)]
method: RPBEPBE
basis: SDD
operation: Freq
keyword: #pfreq=noraman
keyword: PBEPBE/SDD
title: #p freq=noraman PBEPBE/SDD
converged: YES YES NO NO
title: Mulliken charges:
elementType: O O C C C C C C C C C C C C C C H H H H H H H H H H H H H H H H H H H H H H
charge: -0.301681 -0.265013 -0.234085 0.550231 0.346348 -0.113942 -0.468406 -0.393746 -0.358924 -0.416733 -0.693094 -0.692729 -0.256333 -0.224663 -0.664488 -0.683180 0.207088 0.208023 0.231855 0.226687 0.248777 0.277166 0.211070 0.210717 0.227362 0.226423 0.210947 0.212039 0.216942 0.215654 0.213863 0.212800 0.213303 0.218624 0.230049 0.204075 0.225369 0.221607
chargesum: 0.00000
title: Mulliken charges with hydrogens summed into heavy atoms:
elementType: O O C C C C C C C C C C C C C C
charge: -0.301681 -0.265013 -0.026997 0.550231 0.346348 0.094081 -0.236551 -0.167060 -0.110147 -0.139567 -0.043945 -0.043319 0.176264 0.202000 -0.002513 -0.032130
polarizability: 2.08716200e+02 -3.37694009e+00 1.42109133e+02 2.01565788e+00 1.18449277e+01 1.29749284e+02
1716.lowfreq: -10.7090 -2.4046 -0.0008 -0.0004 -0.0002 4.7532 17.6921 33.2630 37.5323
frequency: 17.1287 33.1859 37.5266 43.9374 51.7417 83.1445 103.4304 110.3509 161.6150 182.7976 207.6511 219.1795 222.3751 233.3850 244.4717 256.3915 284.2912 304.6730 349.1016 379.8306 404.7961 408.6816 460.1598 482.9469 542.4569 566.6854 633.8618 644.7809 717.9096 752.9028 783.8237 800.5888 811.6634 833.1401 841.6493 857.6066 888.1860 893.9543 918.8849 926.9582 954.2255 964.5229 977.2879 988.4611 1014.7963 1024.6432 1043.8084 1051.8842 1085.1090 1110.8409 1113.3163 1115.4824 1138.4223 1154.2939 1154.8948 1183.2054 1208.5764 1219.8500 1248.1701 1267.1960 1291.4674 1309.1383 1311.9243 1314.4398 1331.0373 1352.8877 1360.3926 1376.8545 1385.6646 1387.3355 1392.9538 1395.0696 1408.8045 1459.5336 1462.2332 1466.2975 1468.0169 1472.1851 1478.7882 1480.5973 1483.3477 1483.5401 1496.7365 1505.2724 1582.5675 1622.8794 2973.4772 2973.7839 2976.4943 2978.0381 2978.4249 2984.6375 2989.8488 2997.0186 3029.2927 3063.9826 3067.1332 3073.9618 3076.9203 3079.6534 3081.4399 3086.7661 3096.0228 3098.0625 3113.1395 3121.6838 3140.2229 3172.3382
redmass: 3.0576 2.8341 2.7082 2.9171 2.8447 2.2457 2.8562 3.0205 2.9782 1.6875 1.6017 1.7730 1.6521 1.3291 1.3722 2.3991 2.5413 2.9810 3.1683 3.8456 2.9909 3.1115 3.9759 3.2342 2.8504 3.4359 6.7701 3.9800 3.0120 3.9743 3.1599 1.1504 1.1069 2.0916 2.4645 1.2814 2.5797 3.1564 1.1853 4.6449 1.4414 1.6650 2.2056 1.4438 2.9592 2.9509 4.3718 1.5366 2.0916 1.7054 1.8433 2.5854 1.4523 1.7628 1.6522 1.2042 1.8198 1.9937 1.1547 1.1873 1.5049 1.3255 1.7020 1.1943 1.4481 1.2536 1.2859 1.1933 1.6107 2.1518 1.2640 1.2812 2.4712 1.0412 1.0452 1.0448 1.0511 1.0585 1.0487 1.0453 1.0869 1.0973 1.0853 2.3756 6.8434 6.4031 1.0551 1.0354 1.0403 1.0792 1.0786 1.0396 1.0363 1.0620 1.1063 1.1019 1.1000 1.0992 1.1005 1.0984 1.0996 1.0988 1.1013 1.1025 1.0875 1.0892 1.0959 1.0939
irintensity: 0.1305 0.6248 0.2186 0.1695 0.2703 1.0722 1.6842 0.4087 6.7495 0.5542 0.3575 0.4761 0.7266 0.2845 0.2319 1.5215 12.2877 1.3335 3.1055 0.6347 1.4064 2.1012 8.9925 1.6977 13.8231 3.9504 1.4824 3.2220 12.7164 1.4048 8.2334 11.0729 2.5858 31.1585 15.1414 4.3392 7.3514 41.4468 3.0145 197.1712 0.0005 17.0522 18.1919 1.4746 27.5886 125.2757 115.8546 22.2411 30.5179 12.5748 3.3005 1.6011 8.6084 0.1033 20.5585 11.8947 4.2388 4.2066 0.1541 17.5293 15.2946 1.1295 40.1886 2.7556 19.4823 1.3727 0.9093 15.9685 16.0804 13.2572 24.3834 9.0161 11.9600 9.9215 12.4800 3.2303 2.4204 0.3282 16.0808 6.2120 17.0716 2.0923 5.3226 23.9386 1.5049 5.1684 30.2916 40.2644 38.3772 20.0644 20.6380 38.6182 27.5870 41.2838 26.2962 3.0522 0.7022 107.9554 24.4904 51.7140 40.1903 34.3403 47.5762 41.4724 14.3526 23.1627 14.7127 3.2704
temp: 298.150 k
press: 1.00000 atm
elementType: 8 8 6 6 6 6 6 6 6 6 6 6 6 6 6 6 1 1 1 1 1 1 1 1 1 1 1 1 1 1 1 1 1 1 1 1 1 1
symmnumber: 1
zpe: 861007.1 jmol-1
zpe.correction: 0.327940 hartree
zpe.thermalcorrener: 0.346456 hartree
zpe.thermalcorrenthalpy: 0.347400 hartree
zpe.thermalcorrgfe: 0.278977 hartree
zpe.sumelectzpe: -695.866204 hartree
zpe.sumelectthermal: -695.847688 hartree
zpe.sumelectthermalent: -695.846744 hartree
zpe.sumelectthermalfe: -695.915168 hartree
dipole: -0.0201 -0.0618 -0.3089
dipole: 0.3157
quadrupole: -87.0208 -95.8330 -97.2373
quadrupole: -3.9942 -2.2432 0.4821
quadrupole: 6.3429 -2.4693 -3.8736 -3.9942 -2.2432 0.4821
hfenergy: -696.1941442 hartree
pointgroup: C01 [X(C14H22O2)]
dipole: 0.0077298 0.0091021 0.1236167 debye
polarizability: 208.8921686|-0.9493367|134.8195046|0.6036037|-13.3723391|136.8629442 unknown
InChI: InChI=1S/C14H22O2/c1-5-15-14(16-6-2)13-9-7-12(8-10-13)11(3)4/h7-11,14H,5-6H2,1-4H3
charge 0 multiplicity 1
38 atoms
O  -2.382628 -0.618866 0.936762
O  -2.422883 1.034625 -0.832897
C  4.066033 -0.140305 -0.124579
C  2.535476 -0.164072 -0.167525
C  -0.326105 -0.204724 -0.258764
C  -1.847177 -0.233106 -0.359089
C  1.834923 0.252543 -1.328333
C  1.772169 -0.600248 0.946787
C  0.424365 0.23387 -1.376706
C  0.361601 -0.624824 0.904253
C  4.655889 -1.559567 0.092486
C  4.590215 0.844689 0.954873
C  -3.829865 -0.936323 0.919252
C  -2.105602 2.213645 0.0103
C  -4.102013 -2.370297 0.440138
C  -2.932191 3.378886 -0.532355
H  4.421722 0.223134 -1.110227
H  -2.182696 -0.936355 -1.148895
H  2.402065 0.594576 -2.203277
H  2.282985 -0.928539 1.860448
H  -0.102236 0.571081 -2.277481
H  -0.221044 -0.967043 1.763822
H  4.346969 -1.972243 1.070833
H  5.761317 -1.528286 0.072838
H  4.313628 -2.258504 -0.691738
H  4.207522 1.86671 0.782274
H  5.695694 0.880314 0.945399
H  4.270485 0.530823 1.965959
H  -4.148355 -0.807455 1.967877
H  -4.358797 -0.192308 0.292279
H  -2.360945 1.987555 1.064062
H  -1.01953 2.426892 -0.047258
H  -5.182027 -2.597915 0.517631
H  -3.804284 -2.513427 -0.614125
H  -3.547325 -3.097068 1.058571
H  -2.728509 4.296811 0.049475
H  -2.683039 3.573949 -1.590074
H  -4.011708 3.156271 -0.468296
