program: Gaussian 09
title: 000227882
version: EM64L-G09RevD.01
frameworkgroup: C1[X(C13H18O3)]
method: RPBEPBE
basis: SDD
operation: Freq
keyword: #pfreq=noraman
keyword: PBEPBE/SDD
title: #p freq=noraman PBEPBE/SDD
converged: YES YES NO NO
title: Mulliken charges:
elementType: O O O C C C C C C C C C C C C C H H H H H H H H H H H H H H H H H H
charge: -0.288542 -0.277417 -0.255662 -0.237650 0.560951 -0.689491 -0.689441 -0.455194 -0.388852 0.222249 -0.348100 -0.359063 0.178190 -0.300408 -0.259303 -0.495896 0.211451 0.211534 0.214968 0.229467 0.228755 0.215142 0.211784 0.238049 0.233133 0.267919 0.268257 0.244172 0.238376 0.228179 0.198356 0.202411 0.234958 0.206717
chargesum: 0.00000
title: Mulliken charges with hydrogens summed into heavy atoms:
elementType: O O O C C C C C C C C C C C C C
charge: -0.288542 -0.277417 -0.255662 -0.026198 0.560951 -0.033521 -0.033760 -0.217145 -0.155719 0.222249 -0.080181 -0.090806 0.178190 0.182140 0.167232 0.148190
polarizability: 2.32888395e+02 -7.10025341e+00 1.34687082e+02 7.29274521e+00 1.15729108e+01 1.03893688e+02
1716.lowfreq: -4.9274 -3.0190 -0.0008 -0.0006 -0.0002 12.8742 26.8362 36.0353 40.6423
frequency: 26.7255 35.7783 40.2466 60.5373 70.7439 83.3069 92.3299 121.5961 174.5540 200.8792 209.9660 218.6334 223.1875 234.2902 252.1829 291.9801 336.5718 354.8844 407.2459 407.9523 424.6178 475.0336 514.7179 538.9279 603.0149 633.1649 686.7304 721.1891 766.9993 776.4538 831.6430 858.8193 865.6891 888.6137 889.6873 919.8311 936.1362 956.2445 985.5876 993.9181 1010.1563 1049.3224 1051.4492 1065.4531 1089.4248 1106.1056 1109.7805 1114.3692 1132.6891 1155.6312 1161.4299 1186.0931 1199.8777 1220.9675 1250.4315 1273.8939 1292.7874 1309.8989 1327.6445 1330.0599 1378.7598 1387.7105 1392.7219 1399.0583 1413.9526 1439.8274 1457.7575 1458.6205 1466.8441 1467.4019 1470.0833 1479.6625 1484.1056 1494.6815 1501.5034 1573.8835 1618.7555 1621.9216 2927.7771 2941.9385 2976.3241 2979.4998 2984.5557 2999.9551 3004.4092 3046.4873 3070.1039 3077.3328 3079.4364 3083.9195 3105.3736 3124.8361 3128.5675 3129.1981 3158.4098 3173.9557
redmass: 4.0582 3.6495 3.4644 2.3781 3.8020 3.7523 3.3613 3.4488 3.2361 1.3939 3.3709 1.5627 1.3089 3.6382 1.3370 3.6120 3.2882 4.1493 2.9034 3.8325 3.6816 3.8337 4.6455 3.0379 3.4370 6.7396 3.9930 3.8373 4.1055 4.0357 1.2931 1.2825 1.6262 5.1667 2.7965 1.1930 5.8759 1.4412 1.3620 1.3807 3.4471 3.2249 1.7007 5.6535 4.0807 1.3226 2.5802 1.4839 1.5187 1.7590 1.4990 1.1441 1.1878 1.9316 3.8058 1.1183 1.5648 1.3176 1.6478 1.2798 1.1946 1.3572 3.2577 1.3133 2.7434 1.1524 1.0988 1.0527 1.0476 1.0480 1.0585 1.0491 1.1600 1.0766 2.1294 7.1915 6.3141 10.1120 1.0359 1.0544 1.0349 1.0354 1.0843 1.1044 1.1039 1.0578 1.1000 1.0993 1.1006 1.0998 1.0975 1.0890 1.1081 1.0898 1.0952 1.0948
irintensity: 0.9307 0.7659 0.3668 4.1281 4.2268 0.5152 0.3453 1.9426 0.9368 1.2375 3.1753 0.8609 3.5453 1.9400 0.7169 10.6866 10.0597 0.2470 0.3598 2.3537 9.4257 4.3204 6.5107 10.3152 2.3600 0.7836 38.0774 3.6415 5.0085 4.9509 0.1418 3.8797 37.4301 12.2616 7.9931 3.8927 5.0770 0.0148 1.0493 0.0129 67.3425 131.0296 27.2961 312.1508 15.7397 5.1715 0.9826 16.7696 12.5266 0.8676 4.7708 76.0037 13.0215 6.4017 287.9991 4.8487 6.2335 0.5202 7.6192 10.9290 15.5050 11.4689 0.8661 9.3956 15.8327 0.1486 23.0916 16.0741 6.2248 0.4722 13.7891 16.3645 16.2215 5.4670 9.5021 18.4396 71.5809 201.1823 76.1948 58.8381 31.0097 35.3777 18.2632 76.4545 31.0150 30.4077 2.9880 96.1639 25.3949 37.8834 33.6296 15.0309 9.2987 19.3434 6.7524 2.5912
temp: 298.150 k
press: 1.00000 atm
elementType: 8 8 8 6 6 6 6 6 6 6 6 6 6 6 6 6 1 1 1 1 1 1 1 1 1 1 1 1 1 1 1 1 1 1
symmnumber: 1
zpe: 741968.3 jmol-1
zpe.correction: 0.282601 hartree
zpe.thermalcorrener: 0.300043 hartree
zpe.thermalcorrenthalpy: 0.300988 hartree
zpe.thermalcorrgfe: 0.235279 hartree
zpe.sumelectzpe: -730.619812 hartree
zpe.sumelectthermal: -730.602369 hartree
zpe.sumelectthermalent: -730.601425 hartree
zpe.sumelectthermalfe: -730.667134 hartree
dipole: 2.0124 -2.0170 1.3226
dipole: 3.1413
quadrupole: -80.1326 -96.9023 -95.6641
quadrupole: 5.8231 -6.4516 0.7076
quadrupole: 10.7671 -6.0027 -4.7644 5.8231 -6.4516 0.7076
hfenergy: -730.9024128 hartree
pointgroup: C01 [X(C13H18O3)]
dipole: 0.8182864 -0.7831804 0.4943734 debye
polarizability: 233.317867|-4.3346882|133.7530406|5.8065553|12.5591155|104.3982576 unknown
InChI: InChI=1S/C13H18O3/c1-10(2)11-4-6-12(7-5-11)13(14)16-9-8-15-3/h4-7,10H,8-9H2,1-3H3
charge 0 multiplicity 1
34 atoms
O  -1.960071 -0.584039 -0.837513
O  -5.585868 -0.892426 -0.127551
O  -1.906458 1.571503 0.061562
C  4.499741 -0.218066 0.246813
C  2.986424 -0.042584 0.106484
C  5.176857 -0.44195 -1.132356
C  4.849344 -1.370181 1.227314
C  2.355972 1.164488 0.507011
C  2.172909 -1.079486 -0.426959
C  0.164294 0.295872 -0.157657
C  0.963518 1.336768 0.379646
C  0.781128 -0.91814 -0.560326
C  -1.301515 0.523875 -0.278898
C  -3.42685 -0.44777 -1.034602
C  -4.173262 -0.820295 0.251744
C  -6.450655 -1.187646 1.012792
H  4.907014 0.720909 0.672817
H  4.822148 -1.377901 -1.602356
H  6.273823 -0.517579 -1.015817
H  4.957487 0.389325 -1.826019
H  4.395142 -1.203121 2.220419
H  5.944859 -1.449267 1.354877
H  4.482932 -2.341408 0.846069
H  2.966574 1.975802 0.92138
H  2.633757 -2.022756 -0.742789
H  0.475259 2.267597 0.686972
H  0.161181 -1.717797 -0.975015
H  -3.668579 0.584379 -1.338301
H  -3.671786 -1.158016 -1.838897
H  -4.010632 -0.04942 1.033947
H  -3.817191 -1.803258 0.63151
H  -6.20225 -2.170346 1.468036
H  -7.479305 -1.215741 0.620693
H  -6.374843 -0.401928 1.794173
