program: Gaussian 09
title: 000227877
version: EM64L-G09RevD.01
frameworkgroup: C1[X(C13H16O2)]
method: RPBEPBE
basis: SDD
operation: Freq
keyword: #pfreq=noraman
keyword: PBEPBE/SDD
title: #p freq=noraman PBEPBE/SDD
converged: NO YES NO NO
title: Mulliken charges:
elementType: O O C C C C C C C C C C C C C H H H H H H H H H H H H H H H H
charge: -0.280196 -0.262613 -0.236517 0.560603 -0.690264 -0.689317 -0.454606 -0.389794 0.227258 -0.348770 -0.356729 0.187530 -0.364783 -0.031175 -0.551904 0.210956 0.211093 0.214851 0.229213 0.229018 0.214808 0.212188 0.237688 0.232977 0.267813 0.268147 0.219936 0.239349 0.254399 0.221761 0.217080
chargesum: 0.00000
title: Mulliken charges with hydrogens summed into heavy atoms:
elementType: O O C C C C C C C C C C C C C
charge: -0.280196 -0.262613 -0.025561 0.560603 -0.035107 -0.033303 -0.216918 -0.156817 0.227258 -0.080957 -0.088583 0.187530 0.094502 0.223224 -0.113063
polarizability: 2.25896040e+02 -7.23002594e+00 1.37078325e+02 -7.03245673e-01 9.57529705e+00 9.75949675e+01
1716.lowfreq: -3.0867 -0.0006 -0.0005 -0.0004 4.9618 14.0350 34.0539 39.1184 45.9507
frequency: 33.8233 38.2436 45.9156 68.1034 82.9960 104.0839 124.2412 185.6592 205.5942 217.2027 237.5065 255.5142 283.0610 329.9976 349.4363 370.0321 407.8568 418.6634 474.4239 494.0503 538.5912 597.5664 632.9434 661.8779 687.6907 725.8070 766.3387 778.1155 859.6734 865.9734 882.4354 890.2170 920.0198 931.7922 956.7135 959.0009 967.4272 985.7367 994.1855 1008.2581 1018.3964 1049.9206 1052.1173 1110.9687 1114.6307 1155.5083 1157.8292 1187.0802 1221.4196 1247.3831 1251.5648 1283.8935 1293.3938 1309.3168 1327.8995 1345.9058 1379.7048 1392.6228 1400.2596 1414.0702 1428.0195 1448.1511 1467.5458 1467.7984 1480.0290 1484.6638 1501.5853 1573.4515 1617.8859 1618.8167 1660.4502 2976.5459 2979.1757 2983.4850 3018.9725 3069.8855 3076.9457 3079.2900 3083.4706 3090.1316 3106.1797 3125.0315 3129.9533 3130.2541 3158.5571 3173.8780 3200.2326
redmass: 3.6702 3.4888 3.6842 3.9217 4.4139 2.6940 3.6458 2.6223 1.6383 1.6074 2.2322 1.6061 4.0821 3.0398 2.9638 3.2320 2.8559 3.0224 3.7255 2.5951 3.0082 3.0692 6.7233 1.9677 3.8840 4.4600 4.1028 4.9590 1.2811 1.6191 4.0023 2.5512 1.1922 1.6272 1.4398 1.4007 1.9724 1.3590 1.3797 3.2961 1.2696 2.7902 1.8864 2.5469 1.4835 1.7630 2.0372 1.1489 1.9234 2.1031 1.4867 1.2501 1.5678 1.3211 1.6501 1.2614 1.1953 3.4950 1.2751 2.7450 1.1554 1.1423 1.0453 1.0505 1.0489 1.1648 2.1161 7.2559 10.0444 6.3441 4.6064 1.0350 1.0355 1.0842 1.0602 1.1000 1.0992 1.1005 1.0998 1.0611 1.1025 1.0890 1.0892 1.0964 1.0952 1.0948 1.1142
irintensity: 0.3148 0.6161 0.3971 0.2221 0.6286 0.6538 0.9341 0.8265 0.4550 0.2585 0.5686 0.8285 12.6992 2.7442 3.4487 5.2793 0.0192 3.1529 4.2005 0.6021 12.2266 6.8480 0.8198 5.7054 39.0359 2.0361 4.4171 2.8738 4.0763 37.9425 42.4217 4.4364 3.7542 42.1879 0.0415 75.0516 11.2878 0.9788 0.0215 120.6418 22.6721 284.7591 7.7709 1.2826 16.3230 1.6700 25.8504 64.3861 7.7872 238.0576 65.1171 14.6063 6.0313 0.5485 7.8043 13.6744 15.5306 0.8208 9.2829 16.5220 12.0244 33.8791 4.3876 2.3945 15.8856 16.7201 10.4285 22.7794 182.1939 88.9317 3.8345 30.5868 36.1629 18.5619 33.5689 1.3586 97.6469 25.7439 38.7825 8.9430 7.4174 15.0738 16.3944 6.4587 7.1241 2.5967 22.8139
temp: 298.150 k
press: 1.00000 atm
elementType: 8 8 6 6 6 6 6 6 6 6 6 6 6 6 6 1 1 1 1 1 1 1 1 1 1 1 1 1 1 1 1
symmnumber: 1
zpe: 670991.6 jmol-1
zpe.correction: 0.255567 hartree
zpe.thermalcorrener: 0.271178 hartree
zpe.thermalcorrenthalpy: 0.272122 hartree
zpe.thermalcorrgfe: 0.211178 hartree
zpe.sumelectzpe: -654.301337 hartree
zpe.sumelectthermal: -654.285727 hartree
zpe.sumelectthermalent: -654.284782 hartree
zpe.sumelectthermalfe: -654.345726 hartree
dipole: -1.5718 -1.7978 -0.2889
dipole: 2.4054
quadrupole: -74.5343 -90.3667 -89.3792
quadrupole: -7.2408 -2.3394 2.0590
quadrupole: 10.2258 -5.6067 -4.6191 -7.2408 -2.3394 2.0590
hfenergy: -654.5569045 hartree
pointgroup: C01 [X(C13H16O2)]
dipole: 0.5967683 0.7313477 -0.067741 debye
polarizability: 226.249812|-4.565162|137.7470547|0.9356199|-7.0806878|96.5724658 unknown
InChI: InChI=1S/C13H16O2/c1-4-9-15-13(14)12-7-5-11(6-8-12)10(2)3/h4-8,10H,1,9H2,2-3H3
charge 0 multiplicity 1
31 atoms
O  -2.432252 0.406976 -0.699225
O  -2.238093 -1.832895 -0.068453
C  4.069418 0.263434 0.192621
C  2.563655 0.026967 0.061814
C  4.388309 1.340337 1.26434
C  4.70596 0.636003 -1.173473
C  2.006381 -1.25139 0.326572
C  1.684986 1.074102 -0.32954
C  -0.243364 -0.429071 -0.184017
C  0.62196 -1.482396 0.206467
C  0.299776 0.855372 -0.451205
C  -1.699242 -0.719429 -0.296086
C  -3.913656 0.202322 -0.843297
C  -4.613762 0.351272 0.483052
C  -5.515764 1.327266 0.751712
H  4.528649 -0.688579 0.527236
H  3.977002 2.325267 0.975195
H  5.481632 1.453786 1.383814
H  3.95839 1.068709 2.245052
H  4.509581 -0.142535 -1.932268
H  5.800733 0.752687 -1.070484
H  4.299375 1.590793 -1.555721
H  2.668097 -2.071776 0.629766
H  2.088454 2.071554 -0.539917
H  0.189921 -2.467935 0.40969
H  -0.371881 1.665118 -0.749606
H  -4.219851 0.978453 -1.561964
H  -4.074069 -0.807564 -1.263537
H  -4.366247 -0.404713 1.239648
H  -6.024144 1.3873 1.720264
H  -5.777453 2.091366 0.008653
