program: Gaussian 09
title: 000227870
version: EM64L-G09RevD.01
frameworkgroup: C1[X(C12H17NO)]
method: RPBEPBE
basis: SDD
operation: Freq
keyword: #p
keyword: freq=noraman
keyword: PBEPBE/SDD
title: #p freq=noraman PBEPBE/SDD
converged: YES YES NO NO
title: Mulliken charges:
elementType: O N C C C C C C C C C C C C H H H H H H H H H H H H H H H H H
charge: -0.289226 -0.390472 -0.235600 0.564527 -0.691388 -0.690472 -0.460797 -0.417540 0.281460 -0.362018 -0.368757 0.161834 -0.339447 -0.653329 0.211342 0.210056 0.214347 0.228855 0.230043 0.214036 0.209223 0.235842 0.230511 0.274052 0.205220 0.298618 0.260789 0.212958 0.200426 0.236228 0.218680
chargesum: 0.00000
title: Mulliken charges with hydrogens summed into heavy atoms:
elementType: O N C C C C C C C C C C C C
charge: -0.289226 -0.091854 -0.024258 0.564527 -0.038131 -0.037170 -0.224955 -0.187029 0.281460 -0.087966 -0.163538 0.161834 0.134300 0.002005
polarizability: 2.08449479e+02 1.09448279e+00 1.34983891e+02 2.30102708e+00 3.35391597e+00 8.90477146e+01
1716.lowfreq: -7.7281 -2.6562 -0.0006 0.0004 0.0006 5.0093 23.7671 35.1701 44.3206
frequency: 23.5102 35.0541 44.2398 60.1383 83.8031 128.8885 180.3474 205.8296 217.6251 232.8148 244.0252 263.3914 317.1953 331.8650 360.4414 400.9815 410.2332 473.0212 487.8772 534.8310 557.9138 598.3807 634.9866 690.7333 729.9066 766.6565 774.2336 836.1140 848.2788 869.6144 889.4161 893.6015 918.0764 954.3498 958.4778 993.5655 1009.3380 1042.2640 1053.0796 1086.6534 1112.7780 1112.9741 1138.4058 1154.2204 1157.8751 1197.1650 1223.4544 1263.4448 1282.8376 1294.3370 1306.4510 1323.7719 1353.8233 1377.9800 1386.2988 1387.4242 1396.9008 1408.8599 1466.2926 1466.9531 1468.1464 1473.0798 1479.6629 1480.0481 1482.4425 1489.6644 1512.0446 1564.2388 1602.6620 1619.8340 2974.8635 2977.4932 2980.2635 2981.7640 2987.9787 3064.1459 3067.6914 3074.8185 3078.6026 3082.7276 3083.4191 3096.3361 3109.2492 3123.3680 3136.3267 3159.9105 3559.0688
redmass: 2.7770 3.2836 3.3408 3.6228 3.7450 2.9146 2.9687 1.5265 1.2303 1.8510 1.3505 2.0864 2.8740 3.2339 3.4551 2.8467 3.0766 3.8238 3.0955 2.1965 1.4383 3.3382 6.6416 3.8907 2.8118 3.9243 1.7755 1.4773 2.4816 1.4571 2.5256 2.1373 1.1783 1.5007 1.3504 1.3852 3.2329 3.2323 1.5996 2.0486 2.5505 1.4920 1.6605 2.4081 1.9874 1.1669 1.9317 1.9809 1.2736 1.6384 1.3254 1.6421 1.3363 1.1919 3.3359 1.2326 1.2371 2.8133 1.0452 1.1529 1.0507 1.0582 1.0573 1.2144 1.1356 1.3503 2.3193 6.6713 6.9450 6.3593 1.0349 1.0352 1.0364 1.0843 1.0664 1.0975 1.1000 1.0991 1.1005 1.0998 1.0968 1.1014 1.0865 1.0893 1.0953 1.0949 1.0770
irintensity: 1.3124 1.9853 2.5670 1.8475 1.8580 1.8570 1.7179 0.8626 0.3480 2.7745 0.1032 0.6016 11.1658 5.4854 1.3170 0.5337 0.1450 5.3627 2.2966 7.5960 110.5822 3.2640 0.2323 29.5268 0.9474 4.8570 7.8827 15.0162 11.7272 24.2079 7.5467 6.9757 4.0737 0.0427 0.0155 2.2810 9.3957 6.7876 38.9708 7.6623 1.1175 11.4310 9.8257 10.4252 25.8331 15.8961 3.3962 75.5559 127.7743 21.0542 0.7171 1.0918 6.6247 15.4200 0.6232 17.1379 9.3399 2.5278 0.6478 77.8818 5.9609 8.3926 13.2702 22.2089 16.5985 173.5193 65.8813 50.6413 111.8940 28.8321 30.5824 36.4555 32.3545 17.7204 59.6559 12.9491 1.0480 104.3289 24.3192 40.7253 38.6344 34.0817 19.6679 19.1796 20.0349 3.9691 9.6412
temp: 298.150 k
press: 1.00000 atm
elementType: 8 7 6 6 6 6 6 6 6 6 6 6 6 6 1 1 1 1 1 1 1 1 1 1 1 1 1 1 1 1 1
symmnumber: 1
zpe: 691823.5 jmol-1
zpe.correction: 0.263502 hartree
zpe.thermalcorrener: 0.278556 hartree
zpe.thermalcorrenthalpy: 0.279500 hartree
zpe.thermalcorrgfe: 0.219648 hartree
zpe.sumelectzpe: -596.414712 hartree
zpe.sumelectthermal: -596.399657 hartree
zpe.sumelectthermalent: -596.398713 hartree
zpe.sumelectthermalfe: -596.458565 hartree
dipole: 1.5300 -3.6419 -1.1169
dipole: 4.1051
quadrupole: -74.1273 -84.5370 -88.0182
quadrupole: 11.5400 3.6314 -0.1783
quadrupole: 8.1002 -2.3095 -5.7907 11.5400 3.6314 -0.1783
hfenergy: -596.6782133 hartree
pointgroup: C01 [X(C12H17N1O1)]
dipole: 0.5883816 -1.4655419 0.3383858 debye
polarizability: 208.3759461|2.0270238|126.6028812|3.4796641|-18.0120235|97.5022573 unknown
InChI: InChI=1S/C12H17NO/c1-4-13-12(14)11-7-5-10(6-8-11)9(2)3/h5-9,13H,4H2,1-3H3
charge 0 multiplicity 1
31 atoms
O  -2.594659 1.739766 -0.813164
N  -2.882839 -0.530541 -0.38718
C  3.770247 0.081905 -0.074648
C  2.247791 0.192441 -0.183477
C  4.306149 -1.164713 -0.829035
C  4.238167 0.075485 1.405511
C  1.642233 1.304013 -0.823933
C  1.395987 -0.805757 0.359334
C  -0.603454 0.407735 -0.398679
C  0.240924 1.41513 -0.926969
C  -0.005933 -0.702238 0.255725
C  -2.092886 0.600606 -0.544322
C  -4.35284 -0.481962 -0.450516
C  -5.017038 -0.828746 0.898777
H  4.204133 0.979516 -0.559592
H  3.920874 -2.098311 -0.378244
H  5.410558 -1.199363 -0.784381
H  4.001948 -1.151265 -1.891017
H  3.886578 0.976098 1.939903
H  5.342124 0.045544 1.462423
H  3.849045 -0.809944 1.942038
H  2.279579 2.091893 -1.243982
H  1.830201 -1.669059 0.877596
H  -0.230299 2.27916 -1.406838
H  -0.623311 -1.478566 0.725197
H  -2.43476 -1.436047 -0.243981
H  -4.610112 0.546119 -0.75699
H  -4.710262 -1.170374 -1.241575
H  -4.755284 -1.850713 1.232142
H  -4.698733 -0.117234 1.680285
H  -6.117426 -0.774976 0.806891
