program: Gaussian 09
title: 000227868
version: EM64L-G09RevD.01
frameworkgroup: C1[X(C12H16O2)]
method: RPBEPBE
basis: SDD
operation: Freq
keyword: #pfreq=noraman
keyword: PBEPBE/SDD
title: #p freq=noraman PBEPBE/SDD
converged: NO YES NO YES
title: Mulliken charges:
elementType: O O C C C C C C C C C C C C H H H H H H H H H H H H H H H H
charge: -0.289068 -0.260489 -0.236621 0.560739 -0.690147 -0.690129 -0.455849 -0.389929 0.224048 -0.348572 -0.359392 0.178627 -0.220389 -0.675085 0.210991 0.211570 0.214433 0.229075 0.229073 0.214431 0.211589 0.237357 0.232330 0.267890 0.266617 0.228458 0.228447 0.211659 0.229168 0.229169
chargesum: 0.00000
title: Mulliken charges with hydrogens summed into heavy atoms:
elementType: O O C C C C C C C C C C C C
charge: -0.289068 -0.260489 -0.025630 0.560739 -0.035069 -0.035036 -0.218492 -0.157599 0.224048 -0.080682 -0.092775 0.178627 0.236517 -0.005089
polarizability: 2.06416191e+02 -3.09916900e+00 1.32862041e+02 -4.07430444e-03 -2.93531301e-03 8.46276003e+01
1716.lowfreq: -7.7549 -0.0012 -0.0008 -0.0005 1.5434 4.1143 24.7891 44.8373 61.0305
frequency: 24.4405 44.5002 61.0079 81.4977 81.5464 118.6796 181.1128 194.8811 220.6749 234.2643 249.0622 249.9325 279.6596 336.0585 358.6630 370.4889 408.4902 475.4317 484.0252 538.9933 601.7390 634.1008 687.6452 735.9501 767.0193 798.9293 799.1471 848.3310 860.0855 867.1005 890.0523 919.0147 956.4397 986.0133 994.9793 1009.1470 1023.1132 1050.5103 1062.2502 1111.6924 1112.3221 1115.1330 1135.6877 1155.9568 1186.0874 1222.7518 1246.8732 1247.7799 1293.1989 1307.1296 1326.4900 1358.3759 1378.2015 1391.6803 1397.9991 1398.1946 1413.6847 1462.1740 1466.7818 1468.2410 1474.2611 1479.7784 1484.0076 1487.0294 1501.8303 1573.5582 1618.4060 1619.4469 2974.9814 2977.3351 2982.3709 2994.5577 3008.0582 3065.4729 3068.3986 3075.2447 3078.4602 3082.5092 3091.5916 3105.5779 3123.7897 3128.2367 3158.1701 3172.4508
redmass: 2.7676 3.4519 2.4281 3.8012 5.6356 2.5395 3.1577 2.3210 1.1297 3.7020 1.3687 1.2017 3.3752 3.0600 4.3167 3.4899 2.8653 4.8104 3.2393 3.0183 3.5079 6.7021 3.9870 4.5558 4.0331 1.1023 5.0961 4.2139 1.3008 1.5856 2.5751 1.1773 1.4579 1.3574 1.3781 3.4501 2.3178 1.5446 5.3192 2.1842 2.5973 1.4955 1.4685 1.7724 1.1460 1.9312 3.4437 1.1335 1.5570 1.3221 1.6575 1.4121 1.1906 2.9555 1.3024 1.3231 2.8152 1.0408 1.0446 1.0508 1.0603 1.0485 1.1670 1.0680 2.1314 7.3441 10.9473 6.3207 1.0349 1.0353 1.0844 1.0356 1.0581 1.1065 1.1001 1.0992 1.1006 1.0998 1.0986 1.1025 1.0891 1.0891 1.0951 1.0948
irintensity: 0.3972 0.0254 1.0138 0.9592 0.5228 2.0135 1.7954 2.0674 0.0792 1.0190 1.5366 0.7515 4.1681 5.4603 0.5407 7.4766 0.0053 1.9632 0.7011 12.1389 3.5366 0.6126 35.9129 0.7364 4.6082 2.2757 4.7316 5.4266 6.5125 37.1185 3.6026 3.7693 0.0283 0.9558 0.0280 37.3645 36.8493 74.2985 291.5256 4.2779 0.9277 17.5207 5.5117 0.8198 78.0062 6.7436 328.2043 0.0042 4.9257 0.6408 7.7056 3.9463 15.2454 1.0624 23.1315 6.8570 15.4922 12.0581 1.3366 4.9935 5.6989 17.0733 13.3083 14.4316 10.9328 23.2602 210.9616 63.5975 30.5939 35.5930 18.4755 22.5131 22.7813 8.7983 0.4441 100.4145 23.7388 39.1032 32.7621 46.1736 15.3889 16.9277 7.0457 2.9299
temp: 298.150 k
press: 1.00000 atm
elementType: 8 8 6 6 6 6 6 6 6 6 6 6 6 6 1 1 1 1 1 1 1 1 1 1 1 1 1 1 1 1
symmnumber: 1
zpe: 657987.6 jmol-1
zpe.correction: 0.250614 hartree
zpe.thermalcorrener: 0.265512 hartree
zpe.thermalcorrenthalpy: 0.266456 hartree
zpe.thermalcorrgfe: 0.207365 hartree
zpe.sumelectzpe: -616.282164 hartree
zpe.sumelectthermal: -616.267266 hartree
zpe.sumelectthermalent: -616.266322 hartree
zpe.sumelectthermalfe: -616.325413 hartree
dipole: 1.2808 -2.1063 0.0003
dipole: 2.4651
quadrupole: -68.3116 -85.1012 -86.2673
quadrupole: 8.1952 -0.0020 -0.0014
quadrupole: 11.5817 -5.2078 -6.3739 8.1952 -0.0020 -0.0014
hfenergy: -616.5327785 hartree
pointgroup: C01 [X(C12H16O2)]
dipole: 0.5078062 -0.8262866 0.0001326 debye
polarizability: 206.4437763|-2.7522857|132.8344559|-0.0040604|-0.0029545|84.6276003 unknown
InChI: InChI=1S/C12H16O2/c1-4-14-12(13)11-7-5-10(6-8-11)9(2)3/h5-9H,4H2,1-3H3
charge 0 multiplicity 1
30 atoms
O  -2.833322 -0.513489 0.000046
O  -2.667836 1.812054 0.000062
C  3.718332 -0.056292 -0.000067
C  2.198338 0.118349 -0.000181
C  4.207588 -0.789062 -1.278169
C  4.207426 -0.787994 1.278715
C  1.617496 1.413363 -0.000286
C  1.328875 -1.006759 -0.000128
C  -0.636519 0.454767 -0.000311
C  0.219122 1.585263 -0.000336
C  -0.069584 -0.846829 -0.000193
C  -2.108384 0.686042 -0.00041
C  -4.318915 -0.369422 0.000575
C  -4.899436 -1.780227 0.000984
H  4.170609 0.955867 -0.000464
H  3.801678 -1.816519 -1.328422
H  5.311042 -0.861792 -1.282793
H  3.890817 -0.255136 -2.192027
H  3.890683 -0.253207 2.19208
H  5.310869 -0.860888 1.283465
H  3.801336 -1.815335 1.329859
H  2.271341 2.294016 -0.000332
H  1.7499 -2.019171 -0.000046
H  -0.231159 2.583534 -0.000417
H  -0.733774 -1.715746 -0.000173
H  -4.61307 0.210438 0.894423
H  -4.613723 0.210187 -0.893221
H  -6.0036 -1.729751 0.00136
H  -4.577578 -2.339408 -0.894336
H  -4.576955 -2.339152 0.896239
