program: Gaussian 09
title: 000227867
version: EM64L-G09RevD.01
frameworkgroup: C1[X(C12H15ClO2)]
method: RPBEPBE
basis: SDD
operation: Freq
keyword: #p
keyword: freq=noraman
keyword: PBEPBE/SDD
title: #p freq=noraman PBEPBE/SDD
converged: NO YES NO NO
title: Mulliken charges:
elementType: Cl O O C C C C C C C C C C C C H H H H H H H H H H H H H H H
charge: -0.056549 -0.272164 -0.263203 -0.238264 0.561774 -0.688545 -0.689270 -0.454020 -0.387472 0.230783 -0.347654 -0.352944 0.182279 -0.248027 -0.569331 0.211497 0.212659 0.215287 0.229430 0.228832 0.215477 0.212358 0.238655 0.234712 0.267143 0.272299 0.237987 0.252191 0.264613 0.299465
chargesum: 0.00000
title: Mulliken charges with hydrogens summed into heavy atoms:
elementType: Cl O O C C C C C C C C C C C C
charge: -0.056549 -0.272164 -0.263203 -0.026767 0.561774 -0.031169 -0.032603 -0.215365 -0.152761 0.230783 -0.080510 -0.080645 0.182279 0.242151 -0.005253
polarizability: 2.08354016e+02 -1.38070892e+01 1.38285134e+02 -7.48493051e+00 -1.39020216e+01 9.90801772e+01
1716.lowfreq: -13.1216 -3.3496 -1.2594 -0.0015 -0.0007 0.0015 16.1621 29.6595 34.0413
frequency: 15.4322 29.6408 34.0066 53.2141 86.1332 105.4775 131.9646 181.6520 200.6655 215.1414 232.4515 249.3940 257.8215 341.2420 353.0944 363.3729 405.9184 446.2678 470.6139 493.9295 539.0393 595.4146 612.3982 633.0756 687.9488 724.5649 766.5728 771.7077 832.7592 857.6558 865.3483 889.6827 919.2508 936.6751 954.5787 985.5866 988.0341 993.4646 1011.1663 1041.1802 1051.0884 1073.7604 1108.3086 1116.0799 1156.0949 1175.3466 1189.0464 1221.6738 1243.4837 1250.8633 1293.5812 1304.7123 1307.8055 1328.5427 1370.3041 1378.6986 1393.4589 1399.4222 1415.6863 1430.2949 1442.6509 1466.5275 1467.8076 1479.2844 1484.9997 1502.0623 1573.3280 1617.0554 1619.7641 2977.7712 2980.1375 2984.3060 3009.0232 3060.6523 3071.6473 3078.3299 3080.8716 3085.0814 3113.1486 3125.1189 3131.7693 3151.4013 3159.8061 3174.7097
redmass: 3.8085 7.1491 3.9290 5.3368 5.2632 3.5344 4.2939 3.1736 2.3888 1.3117 2.0494 3.4443 1.7672 3.2413 3.6188 2.5930 2.8448 4.0862 3.8494 3.0962 2.9715 3.7602 4.3362 6.6529 3.9865 4.5532 4.1030 4.7896 2.7415 1.2918 1.6176 2.5837 1.1809 2.2134 1.4648 1.3854 2.2912 1.3824 2.8245 2.4536 1.5716 4.0070 2.5703 1.4867 1.7445 1.2886 1.1445 1.9374 1.1758 3.5884 1.5756 1.1743 1.3155 1.6323 1.2983 1.1937 2.8280 1.3714 2.8531 1.0992 1.0956 1.0444 1.0506 1.0500 1.1645 2.1153 7.2182 10.0176 6.2924 1.0349 1.0353 1.0844 1.0631 1.0591 1.1001 1.0993 1.1006 1.0999 1.1009 1.0891 1.0894 1.1083 1.0952 1.0950
irintensity: 0.7535 0.8407 0.7321 2.1255 0.7121 3.0603 3.0582 2.7643 0.6524 0.1803 1.3136 1.8105 0.5144 9.5709 6.4641 6.7155 0.0471 9.4557 3.7493 3.4642 10.3260 9.6943 15.0464 1.7224 37.3432 5.7930 4.6178 9.2144 5.9075 4.1891 35.4540 3.5764 4.3490 22.4233 0.0302 0.7855 15.6903 0.0984 65.7428 139.4410 36.6832 141.1183 0.8390 17.9091 1.3735 83.7624 37.2447 6.8313 11.4884 277.0526 5.5415 26.3423 0.5557 6.1662 6.2384 15.1129 1.5096 9.4563 16.6698 35.4035 20.6180 1.5540 5.0687 19.7572 12.5749 12.1408 24.6160 208.8603 83.0606 30.0210 34.8838 18.5539 25.6900 19.1332 0.0879 97.5956 23.8108 37.7207 4.7118 14.7018 16.0700 11.2556 6.2540 1.9901
temp: 298.150 k
press: 1.00000 atm
elementType: 17 8 8 6 6 6 6 6 6 6 6 6 6 6 6 1 1 1 1 1 1 1 1 1 1 1 1 1 1 1
symmnumber: 1
zpe: 635929.1 jmol-1
zpe.correction: 0.242213 hartree
zpe.thermalcorrener: 0.257935 hartree
zpe.thermalcorrenthalpy: 0.258879 hartree
zpe.thermalcorrgfe: 0.196011 hartree
zpe.sumelectzpe: -1075.669459 hartree
zpe.sumelectthermal: -1075.653736 hartree
zpe.sumelectthermalent: -1075.652792 hartree
zpe.sumelectthermalfe: -1075.715661 hartree
dipole: 1.8860 0.3641 0.9634
dipole: 2.1489
quadrupole: -79.3362 -101.6913 -96.2704
quadrupole: -6.6200 -5.8268 -1.6336
quadrupole: 13.0964 -9.2587 -3.8378 -6.6200 -5.8268 -1.6336
hfenergy: -1075.9116711 hartree
pointgroup: C01 [X(C12H15Cl1O2)]
dipole: 0.6888136 0.0268371 0.489468 debye
polarizability: 210.1750464|-8.2626945|141.9835908|1.7412678|0.9505019|93.5606904 unknown
InChI: InChI=1S/C12H15ClO2/c1-9(2)10-3-5-11(6-4-10)12(14)15-8-7-13/h3-6,9H,7-8H2,1-2H3
charge 0 multiplicity 1
30 atoms
Cl -4.427518 -1.937676 -1.79957
O  -2.551549 -0.373805 0.370924
O  -2.315791 1.886119 -0.167251
C  3.989651 -0.246473 -0.049598
C  2.480849 0.001513 -0.016669
C  4.384644 -1.19091 -1.217189
C  4.504159 -0.800182 1.306902
C  1.956816 1.307691 -0.201924
C  1.565598 -1.065519 0.196937
C  -0.331576 0.473351 0.042447
C  0.569272 1.546787 -0.175861
C  0.177487 -0.839385 0.22813
C  -1.786606 0.766729 0.058803
C  -4.018661 -0.18278 0.375104
C  -4.619165 -0.229491 -1.023813
H  4.485189 0.729699 -0.224656
H  3.929086 -2.190567 -1.091969
H  5.4819 -1.321549 -1.251767
H  4.051739 -0.786617 -2.189726
H  4.258006 -0.116023 2.138426
H  5.601464 -0.931848 1.277522
H  4.051579 -1.783672 1.531521
H  2.647537 2.142974 -0.36911
H  1.943279 -2.084819 0.337925
H  0.162954 2.553084 -0.322085
H  -0.522314 -1.663855 0.390245
H  -4.254908 0.802092 0.822981
H  -4.400557 -0.99707 1.009292
H  -5.704205 -0.045182 -0.980115
H  -4.132757 0.476678 -1.710356
