program: Gaussian 09
title: 000227866
version: EM64L-G09RevD.01
frameworkgroup: C1[X(C12H15BrO2)]
method: RPBEPBE
basis: SDD
operation: Freq
keyword: #p
keyword: freq=noraman
keyword: PBEPBE/SDD
title: #p freq=noraman PBEPBE/SDD
converged: YES YES NO NO
title: Mulliken charges:
elementType: Br O O C C C C C C C C C C C C H H H H H H H H H H H H H H H
charge: -0.015621 -0.269630 -0.262648 -0.238027 0.561282 -0.688571 -0.689587 -0.454023 -0.389569 0.228631 -0.347477 -0.345087 0.187469 -0.261105 -0.649243 0.211507 0.212856 0.215355 0.229469 0.228822 0.215627 0.212334 0.238772 0.235014 0.267172 0.270380 0.247064 0.256553 0.279737 0.312544
chargesum: 0.00000
title: Mulliken charges with hydrogens summed into heavy atoms:
elementType: Br O O C C C C C C C C C C C C
charge: -0.015621 -0.269630 -0.262648 -0.026520 0.561282 -0.030891 -0.032803 -0.215251 -0.154555 0.228631 -0.080305 -0.074706 0.187469 0.242511 -0.056963
polarizability: 2.07615212e+02 -1.72812011e+01 1.50536293e+02 -8.60722534e+00 -1.42130794e+01 1.03156774e+02
1716.lowfreq: -15.4905 -4.2165 -1.3730 -0.0006 -0.0002 0.0006 11.3989 23.6832 37.7380
frequency: 2.8678 23.6236 37.2374 49.8515 85.2499 103.3607 126.0046 173.7205 193.0671 210.6591 221.8912 243.0734 252.9643 338.7279 346.8297 359.3130 406.8617 437.9766 467.3853 488.3011 532.4853 539.7931 600.8488 632.7659 687.6053 723.1376 766.1747 769.7559 821.3147 858.8703 865.4340 889.1286 919.3524 920.3446 952.8993 973.5797 986.4916 994.0031 1008.3092 1034.0970 1050.4836 1069.6521 1108.1943 1114.8190 1155.2762 1166.3585 1188.3355 1220.5143 1225.0019 1248.9241 1287.7486 1293.4258 1308.4160 1328.4152 1366.5086 1378.7591 1392.7390 1398.3721 1414.8273 1429.1792 1436.0816 1466.1730 1467.2163 1478.3741 1482.8641 1501.2792 1572.9735 1618.6921 1619.6314 2976.7355 2979.5728 2983.5421 3001.8415 3061.8431 3070.3530 3077.7134 3079.6970 3084.0730 3110.3603 3125.6733 3131.4414 3152.3076 3159.1761 3174.7534
redmass: 3.3383 8.5308 4.2953 4.8525 5.2653 3.4721 4.8023 3.5178 2.2465 1.3677 1.7435 2.1876 2.6209 3.0792 3.2008 3.1239 2.8523 3.9674 4.3576 3.2094 3.7506 2.9804 3.4077 6.7573 3.9932 4.4682 4.0593 4.4039 2.5047 1.2736 1.6366 2.5824 1.1825 2.3294 1.4633 1.8450 1.3640 1.3810 3.2459 2.5480 1.5569 4.5867 2.5720 1.4903 1.7512 1.3591 1.1402 1.9113 1.2082 3.4176 1.1840 1.5624 1.3132 1.6230 1.2932 1.1943 2.8813 1.3650 2.8446 1.0974 1.1000 1.0455 1.0495 1.0496 1.1477 2.1759 7.1795 6.2961 10.1502 1.0349 1.0354 1.0844 1.0636 1.0585 1.1002 1.0993 1.1005 1.0998 1.1002 1.0891 1.0894 1.1086 1.0953 1.0950
irintensity: 0.3058 0.6523 0.6275 1.5515 0.6502 2.8779 1.7168 2.9315 0.5588 0.2357 1.0194 0.5893 1.1129 15.9570 7.6018 2.5304 0.0324 9.8132 4.3802 4.1832 8.9467 13.9983 4.1336 1.0489 36.2250 5.2338 5.5854 9.8728 3.1516 2.7119 37.6720 3.4412 4.3404 33.8549 0.0236 6.5251 1.0384 0.1211 92.6380 79.9579 53.2028 188.3687 0.9533 16.7204 2.2380 67.6823 47.2812 7.9803 6.1173 298.3809 33.0056 11.7467 0.5388 5.7976 8.3215 15.1086 1.4932 9.2840 16.8570 34.9639 21.5956 5.1507 1.4896 19.3126 13.3543 11.6886 21.2283 70.1082 225.0915 30.0356 34.5127 18.6318 24.3705 14.1642 0.3100 96.9493 24.6453 37.8552 5.6037 14.3193 15.7613 6.6561 6.6263 2.0841
temp: 298.150 k
press: 1.00000 atm
elementType: 35 8 8 6 6 6 6 6 6 6 6 6 6 6 6 1 1 1 1 1 1 1 1 1 1 1 1 1 1 1
symmnumber: 1
zpe: 634042.8 jmol-1
zpe.correction: 0.241494 hartree
zpe.thermalcorrener: 0.257424 hartree
zpe.thermalcorrenthalpy: 0.258368 hartree
zpe.thermalcorrgfe: 0.192753 hartree
zpe.sumelectzpe: -629.069898 hartree
zpe.sumelectthermal: -629.053968 hartree
zpe.sumelectthermalent: -629.053024 hartree
zpe.sumelectthermalfe: -629.118639 hartree
dipole: 2.0461 0.2463 0.9784
dipole: 2.2813
quadrupole: -82.2756 -102.1290 -98.6923
quadrupole: -8.5266 -5.2672 -0.3163
quadrupole: 12.0900 -7.7633 -4.3267 -8.5266 -5.2672 -0.3163
hfenergy: -629.3113923 hartree
pointgroup: C01 [X(C12H15Br1O2)]
dipole: 0.7281774 0.0170962 0.5244431 debye
polarizability: 211.8417846|-6.6356355|150.9072232|3.5592077|6.2762468|98.5592705 unknown
InChI: InChI=1S/C12H15BrO2/c1-9(2)10-3-5-11(6-4-10)12(14)15-8-7-13/h3-6,9H,7-8H2,1-2H3
charge 0 multiplicity 1
30 atoms
Br -4.455258 -2.008295 -1.897915
O  -2.551232 -0.364927 0.356839
O  -2.308683 1.895241 -0.174825
C  3.992234 -0.252473 -0.053114
C  2.483535 -0.001859 -0.02385
C  4.387332 -1.20129 -1.217094
C  4.503757 -0.801822 1.306211
C  1.962141 1.304221 -0.218518
C  1.565877 -1.065794 0.195351
C  -0.328732 0.476155 0.029196
C  0.574856 1.546241 -0.195129
C  0.178028 -0.83645 0.223454
C  -1.782892 0.774123 0.046313
C  -4.016846 -0.166575 0.378114
C  -4.633566 -0.191257 -1.015729
H  4.489747 0.722177 -0.230745
H  3.929924 -2.199855 -1.089912
H  5.484416 -1.333962 -1.25034
H  4.05638 -0.799492 -2.191415
H  4.255398 -0.115052 2.135026
H  5.601217 -0.933048 1.280372
H  4.051376 -1.784776 1.533525
H  2.65462 2.136977 -0.390702
H  1.941286 -2.084794 0.343929
H  0.170856 2.552671 -0.347165
H  -0.523633 -1.658883 0.388449
H  -4.24119 0.815989 0.838362
H  -4.39679 -0.983678 1.010001
H  -5.717983 -0.005881 -0.963016
H  -4.151174 0.522067 -1.698171
