program: Gaussian 09
title: 000227855
version: EM64L-G09RevD.01
frameworkgroup: C1[X(C11H14O2)]
method: RPBEPBE
basis: SDD
operation: Freq
keyword: #pfreq=noraman
keyword: PBEPBE/SDD
title: #p freq=noraman PBEPBE/SDD
converged: NO YES NO NO
title: Mulliken charges:
elementType: O O C C C C C C C C C C C H H H H H H H H H H H H H H
charge: -0.289636 -0.257691 -0.236909 0.561432 -0.689536 -0.689841 -0.454067 -0.389678 0.238149 -0.348792 -0.354333 0.170276 -0.501119 0.211126 0.211827 0.214572 0.229126 0.229151 0.214643 0.211610 0.237543 0.232842 0.267711 0.267861 0.230297 0.241835 0.241602
chargesum: 0.00000
title: Mulliken charges with hydrogens summed into heavy atoms:
elementType: O O C C C C C C C C C C C
charge: -0.289636 -0.257691 -0.025784 0.561432 -0.034012 -0.034438 -0.216523 -0.156835 0.238149 -0.081081 -0.086473 0.170276 0.212615
polarizability: 1.91405248e+02 1.17358335e-01 1.20171969e+02 -3.61428983e-03 7.15864538e-03 7.55473852e+01
1716.lowfreq: -4.1939 -3.1768 -0.0010 -0.0010 -0.0009 9.2659 30.9225 53.0714 75.0839
frequency: 30.9065 53.0504 75.0677 101.3221 116.5800 134.9753 196.2398 208.6786 217.0601 238.1634 253.1864 308.3092 358.0895 360.1085 406.4670 461.4469 483.7331 537.9363 598.8130 632.5808 686.8824 724.6965 765.8208 781.6929 858.5696 865.8146 889.4540 916.9782 924.1154 955.8737 985.5841 994.1840 1011.4101 1051.1946 1068.0560 1110.6760 1113.8153 1114.4012 1147.7480 1154.5057 1187.8810 1220.8151 1256.7700 1293.4283 1308.3452 1329.0801 1377.1617 1392.1828 1397.4025 1414.5486 1423.8429 1451.5108 1464.4498 1466.0977 1467.4386 1479.1603 1483.2426 1501.8211 1574.1330 1618.9001 1622.5781 2976.9818 2979.6480 2983.8404 3002.4335 3070.4148 3077.3130 3079.7926 3084.1731 3102.8244 3125.2331 3129.1712 3146.1600 3158.9419 3172.9025
redmass: 3.1556 3.6802 3.1691 1.2357 3.8347 2.9448 1.4422 1.9867 2.0862 1.3954 3.7315 4.0610 4.3170 2.9763 2.8555 6.0991 3.0980 2.9874 3.4139 6.8143 4.0259 4.3558 4.0833 5.5475 1.2972 1.6003 2.5815 1.1797 7.9723 1.4604 1.3628 1.3805 3.2760 1.5549 4.7403 2.5848 1.2650 1.4830 1.4755 1.7589 1.1325 1.9449 4.1309 1.5592 1.3197 1.6640 1.1922 2.5897 1.4639 2.6927 1.1880 1.0499 1.0517 1.0447 1.0509 1.0513 1.1358 2.2209 7.1937 6.3249 9.8558 1.0348 1.0354 1.0842 1.0296 1.1000 1.0992 1.1006 1.0997 1.1043 1.0890 1.0891 1.1046 1.0952 1.0949
irintensity: 0.1889 1.7660 0.0230 0.6584 1.0912 2.1562 2.5353 1.1970 2.8459 0.2620 3.1363 16.3180 0.6715 0.0344 0.0095 4.2967 0.0604 12.4231 3.9779 0.6047 36.6825 2.7485 4.8258 5.2960 5.6246 36.9939 3.3694 4.1649 4.5303 0.0318 1.1207 0.0195 38.2771 46.1592 185.1119 0.8942 0.0835 14.4190 64.4217 0.3897 41.9088 6.5339 267.6792 6.1844 0.6545 7.1140 15.2386 1.3698 8.5467 14.6993 33.7840 13.6258 11.8493 1.0908 5.3354 19.7296 13.3305 9.9986 18.2362 48.7657 230.3902 30.8621 35.9655 18.1895 43.7089 0.0538 97.9691 24.0864 38.7709 28.0741 14.8603 16.4696 16.9843 6.8318 2.6889
temp: 298.150 k
press: 1.00000 atm
elementType: 8 8 6 6 6 6 6 6 6 6 6 6 6 1 1 1 1 1 1 1 1 1 1 1 1 1 1
symmnumber: 1
zpe: 584464.3 jmol-1
zpe.correction: 0.222611 hartree
zpe.thermalcorrener: 0.236241 hartree
zpe.thermalcorrenthalpy: 0.237185 hartree
zpe.thermalcorrgfe: 0.181530 hartree
zpe.sumelectzpe: -577.053162 hartree
zpe.sumelectthermal: -577.039532 hartree
zpe.sumelectthermalent: -577.038588 hartree
zpe.sumelectthermalfe: -577.094244 hartree
dipole: -1.6886 -1.7261 0.0049
dipole: 2.4148
quadrupole: -66.0560 -76.2177 -80.0245
quadrupole: -9.2985 0.0171 0.0025
quadrupole: 8.0434 -2.1183 -5.9251 -9.2985 0.0171 0.0025
hfenergy: -577.2757731 hartree
pointgroup: C01 [X(C11H14O2)]
dipole: 0.6677351 -0.6597588 0.1463782 debye
polarizability: 191.3885236|0.5187213|118.241041|1.286364|-9.0792885|77.4950376 unknown
InChI: InChI=1S/C11H14O2/c1-8(2)9-4-6-10(7-5-9)11(12)13-3/h4-8H,1-3H3
charge 0 multiplicity 1
27 atoms
O  -3.116679 -1.001658 0.113978
O  -3.220755 1.275397 -0.3694
C  3.337479 0.181996 -0.058706
C  1.807859 0.180654 -0.074437
C  3.919525 -0.737511 -1.166352
C  3.89464 -0.213416 1.335677
C  1.085448 1.373972 -0.336778
C  1.070195 -1.009862 0.17056
C  -1.046501 0.190183 -0.110771
C  -0.323181 1.384802 -0.355994
C  -0.337233 -1.011075 0.153815
C  -2.532977 0.247811 -0.142189
C  -4.596375 -1.021664 0.097751
H  3.672613 1.217101 -0.271878
H  3.629937 -1.791785 -1.00118
H  5.024089 -0.687052 -1.167751
H  3.556679 -0.439617 -2.166257
H  3.512423 0.457987 2.125218
H  4.999005 -0.159914 1.338122
H  3.606469 -1.247316 1.601703
H  1.636675 2.302649 -0.527996
H  1.602382 -1.94587 0.376965
H  -0.882577 2.304268 -0.558289
H  -0.899749 -1.92971 0.342581
H  -4.865668 -2.066352 0.308032
H  -4.973625 -0.703684 -0.888882
H  -4.997497 -0.343835 0.870158
