program: Gaussian 09
title: 000021479
version: EM64L-G09RevD.01
frameworkgroup: C1[X(C4H7NO4)]
method: RPBEPBE
basis: SDD
operation: Freq
keyword: #pfreq=noraman
keyword: PBEPBE/SDD
title: #p freq=noraman PBEPBE/SDD
converged: YES YES NO NO
title: Mulliken charges:
elementType: O O O O N C C C C H H H H H H H
charge: -0.190875 -0.420646 -0.261837 -0.201881 -0.313262 -0.314788 0.296758 -0.755662 0.178147 0.297208 0.243363 0.324448 0.260008 0.259268 0.212559 0.387191
chargesum: 0.00000
title: Mulliken charges with hydrogens summed into heavy atoms:
elementType: O O O O N C C C C
charge: -0.190875 -0.033455 -0.261837 -0.201881 0.011186 0.225783 0.296758 -0.023826 0.178147
polarizability: 9.05669534e+01 -1.14413877e-01 6.06800616e+01 -2.19459208e+00 -6.50687346e-01 4.63446957e+01
1716.lowfreq: -3.3351 -0.0005 -0.0001 0.0005 3.6834 9.5639 30.8168 53.6563 76.7988
frequency: 30.7174 53.6181 76.7806 109.8637 122.2991 192.1172 250.2960 308.1837 421.2510 436.7777 437.0593 499.1136 564.9539 599.5155 622.3302 649.3533 876.7866 894.9594 945.3148 967.4482 1000.3994 1036.1101 1046.4125 1065.7004 1166.4098 1242.9355 1254.6117 1361.5874 1383.5207 1420.4014 1448.6919 1455.9718 1468.3948 1625.0243 1694.0105 2998.4669 2999.7571 3063.6233 3099.5224 3106.0710 3523.7676 3539.7702
redmass: 9.5296 4.0428 2.3336 1.5000 2.6309 7.2133 7.4533 4.3606 2.1407 3.1911 2.3366 1.7337 4.6826 2.7613 1.5214 5.5667 4.2153 4.0238 5.8179 2.2369 1.8782 1.6085 2.7305 3.5178 1.0971 2.4702 1.6173 1.7554 1.2523 1.4630 1.0511 1.0785 1.0953 7.8212 9.0865 1.0372 1.0555 1.1042 1.1000 1.0992 1.0642 1.0805
irintensity: 2.7849 3.3253 4.0339 2.9370 15.3431 0.8335 4.8113 2.1207 38.6965 66.4830 67.3386 34.2966 16.0820 0.8642 143.3912 25.6840 6.2092 23.6258 65.2497 56.9791 4.1877 14.6230 220.3888 31.1820 11.1552 48.3140 12.3702 36.7205 61.8782 72.6544 16.0547 39.8540 17.3696 171.5357 230.4061 15.8818 30.4149 8.3038 15.4799 9.3315 31.5850 26.0072
temp: 298.150 k
press: 1.00000 atm
elementType: 8 8 8 8 7 6 6 6 6 1 1 1 1 1 1 1
symmnumber: 1
zpe: 305406.0 jmol-1
zpe.correction: 0.116323 hartree
zpe.thermalcorrener: 0.126627 hartree
zpe.thermalcorrenthalpy: 0.127571 hartree
zpe.thermalcorrgfe: 0.079027 hartree
zpe.sumelectzpe: -511.508887 hartree
zpe.sumelectthermal: -511.498583 hartree
zpe.sumelectthermalent: -511.497639 hartree
zpe.sumelectthermalfe: -511.546184 hartree
dipole: -1.4221 -0.8207 3.5027
dipole: 3.8684
quadrupole: -37.3483 -56.6976 -54.1563
quadrupole: 11.4474 -1.9421 -1.8409
quadrupole: 12.0524 -7.2969 -4.7555 11.4474 -1.9421 -1.8409
hfenergy: -511.62521 hartree
pointgroup: C01 [X(C4H7N1O4)]
dipole: 0.4628105 -1.4067892 0.3508889 debye
dipolederiv: -0.6004923 -0.0377848 -0.00635 0.0873991 -0.1436313 -0.0121854 -0.1978475 0.1064808 -0.265148 -0.8668812 -0.2372608 -0.4786163 -0.209015 -0.4706747 -0.1225571 -0.4715047 -0.1302046 -0.7726002 -0.6136748 0.1402517 -0.1104205 -0.029988 -0.5537769 0.2935514 0.1142528 0.2862938 -0.8068514 -0.6546957 0.1585401 0.1758243 0.0419296 -0.4890546 -0.3091937 -0.06442 -0.2685238 -0.7607583 -0.1370314 -0.2647531 0.264167 -0.427273 -0.4082676 0.1609891 0.2515725 0.0254729 -0.4530001 0.1773258 0.1511564 0.1483627 0.3186816 0.2430271 -0.0712061 0.5876999 -0.103306 0.1615893 1.0473271 -0.0836254 -0.2234178 0.0560099 0.5248643 -0.4825403 -0.4795213 -0.5012823 1.1011856 -0.4038117 0.1266023 -0.0298017 0.0898914 -0.005539 -0.0108031 0.0410899 -0.0202393 0.0135267 1.42323 -0.0719039 0.2082762 -0.0747447 0.5590195 0.5507076 0.3135717 0.5356517 1.1972278 0.1434226 -0.0143293 0.0145921 0.0047457 0.0812745 0.0377193 -0.1033606 0.0208365 0.0015968 0.0353156 0.006291 -0.0299688 -0.0740508 -0.0872366 -0.0266916 -0.0955373 0.0068547 0.0797231 0.0854097 0.075572 -0.02221 0.0921062 0.3273896 0.0308769 0.025854 0.0681533 0.1699869 0.0180919 -0.0612304 -0.0139757 -0.0885222 -0.0101468 -0.0044858 -0.0179288 0.0122958 0.1210349 0.0768346 0.0248958 0.013173 0.0648654 0.0597057 -0.0708049 0.0317485 -0.087039 -0.0159841 0.0673838 0.0058227 0.01991 0.0457046 0.0364355 0.1114329 -0.0411711 0.1308616 -0.0692631 0.202246 0.0817558 0.0704554 0.1022602 0.3366113 -0.0748092 0.1055021 -0.0823062 0.2977343 unknown
polarizability: 89.8417299|-5.7804944|46.9722557|-1.4227507|0.143881|60.777725 unknown
InChI: InChI=1S/C4H7NO4/c1-3(6)5-9-2-4(7)8/h5,7H,2H2,1H3
charge 0 multiplicity 1
16 atoms
O  -0.082789 -0.006567 0.880641
O  -3.260353 -0.47508 -0.841939
O  1.71066 0.398993 -1.270693
O  -2.747789 0.631569 1.145588
N  1.206516 -0.640019 0.753908
C  -0.980915 -0.496897 -0.191373
C  2.079992 -0.278841 -0.269938
C  3.492197 -0.829626 -0.092078
C  -2.381471 -0.030692 0.159373
H  -0.661717 -0.078168 -1.163167
H  -0.957462 -1.601974 -0.249425
H  1.513943 -1.022005 1.651535
H  4.195245 0.019789 -0.041257
H  3.758973 -1.430638 -0.977403
H  3.617753 -1.450962 0.811613
H  -4.183082 -0.165084 -0.633988
