program: Gaussian 09
title: 000227852
version: EM64L-G09RevD.01
frameworkgroup: C1[X(C9H18O3)]
method: RPBEPBE
basis: SDD
operation: Freq
keyword: #pfreq=noraman
keyword: PBEPBE/SDD
title: #p freq=noraman PBEPBE/SDD
converged: YES YES NO NO
title: Mulliken charges:
elementType: O O O C C C C C C C C C H H H H H H H H H H H H H H H H H H
charge: -0.270744 -0.248443 -0.277055 -0.123881 -0.389641 -0.387064 0.232598 -0.701476 -0.711923 -0.298846 -0.227756 -0.494455 0.220627 0.199172 0.222583 0.219885 0.198965 0.229713 0.215312 0.208598 0.265495 0.207849 0.202155 0.211678 0.259126 0.189422 0.204503 0.203359 0.204092 0.236154
chargesum: 0.00000
title: Mulliken charges with hydrogens summed into heavy atoms:
elementType: O O O C C C C C C C C C
charge: -0.270744 -0.248443 -0.277055 0.096746 0.032114 0.031786 0.232598 -0.047853 -0.036425 0.171957 0.166169 0.149149
polarizability: 1.25054913e+02 1.23346182e+00 1.08433250e+02 3.04421405e+00 1.05879851e+00 9.07343235e+01
1716.lowfreq: 0.0010 0.0011 0.0011 2.2600 13.3191 15.9389 29.2010 45.4314 47.7049
frequency: 28.6770 45.1670 47.6565 83.8664 87.7861 93.5014 129.1549 155.3657 185.6894 196.3908 225.0770 229.8123 253.1523 266.3109 314.3211 325.7777 370.0962 408.3560 448.4768 505.2469 629.8000 699.6155 762.3852 777.2597 803.3199 825.6043 850.7586 915.9300 926.6654 988.1960 1010.1063 1017.8070 1050.5117 1061.0867 1073.4363 1089.8647 1102.4360 1106.5018 1116.2961 1122.6577 1154.8674 1160.1485 1211.0784 1242.8756 1253.8003 1258.9817 1274.2254 1323.1431 1333.9178 1341.9414 1366.2521 1378.8902 1392.8357 1403.3647 1435.4911 1457.7224 1458.6889 1459.1918 1459.4094 1467.9257 1477.5908 1478.5042 1480.4439 1485.8544 1490.7302 1643.7259 2917.7939 2928.6757 2972.8404 2975.8756 2976.9022 2978.9397 2986.2326 3000.8208 3013.3847 3023.2309 3033.1425 3044.7508 3068.9491 3074.8910 3075.8872 3077.3883 3094.6931 3107.4959
redmass: 3.4168 4.6355 4.1633 2.5959 2.3505 2.2995 2.1975 2.6455 2.3813 1.7818 1.4724 1.6620 1.3538 1.9651 2.9786 2.9969 3.2802 2.9165 3.4637 2.6477 2.6684 3.9710 2.6270 1.2903 2.6676 2.6659 1.5590 2.1580 2.1258 2.6122 2.5980 1.6841 1.5721 2.7443 2.7980 3.2626 2.3561 1.8654 1.6225 1.8708 2.3971 1.4928 1.1380 1.2948 1.1305 1.2849 1.1434 1.4060 1.3996 1.2988 1.4979 1.4364 1.2155 1.2032 1.1471 1.0866 1.0770 1.0543 1.0751 1.0783 1.0650 1.0511 1.0468 1.0477 1.0521 8.8648 1.0525 1.0389 1.0369 1.1011 1.0357 1.0596 1.0604 1.1029 1.0863 1.0587 1.1013 1.0990 1.0995 1.0994 1.1008 1.1008 1.1068 1.0972
irintensity: 0.4463 1.2969 0.4030 7.2641 3.7583 1.0784 1.3701 0.5559 1.1780 2.6192 1.2900 4.6574 0.1901 4.0439 2.6666 15.4491 2.8282 1.2175 0.0402 7.7146 0.7315 4.1779 13.6172 1.3690 16.0389 0.6747 8.1031 31.9061 10.1786 20.2966 54.4314 1.6037 14.0396 1.4086 55.5535 225.5257 20.4021 24.0082 26.3726 28.2134 35.7708 14.5017 4.9878 1.0683 4.9614 18.4100 0.4362 4.9437 4.3479 5.5841 21.6072 7.8961 13.5794 10.3547 0.1820 16.5609 5.2365 8.6481 21.7752 14.3793 6.4260 11.0807 13.3049 11.7907 11.6214 142.0214 50.2769 109.3340 31.9690 54.1524 28.6576 15.8478 51.8798 68.8635 10.1840 47.4612 2.1278 10.0696 44.2625 50.1961 12.8780 89.2515 12.0890 25.0573
temp: 298.150 k
press: 1.00000 atm
elementType: 8 8 8 6 6 6 6 6 6 6 6 6 1 1 1 1 1 1 1 1 1 1 1 1 1 1 1 1 1 1
symmnumber: 1
zpe: 679321.1 jmol-1
zpe.correction: 0.258740 hartree
zpe.thermalcorrener: 0.274072 hartree
zpe.thermalcorrenthalpy: 0.275016 hartree
zpe.thermalcorrgfe: 0.215018 hartree
zpe.sumelectzpe: -578.414317 hartree
zpe.sumelectthermal: -578.398985 hartree
zpe.sumelectthermalent: -578.398041 hartree
zpe.sumelectthermalfe: -578.458039 hartree
dipole: -2.0431 -0.0463 -2.6607
dipole: 3.3549
quadrupole: -61.0189 -69.5095 -80.1883
quadrupole: 3.5147 1.0320 1.5992
quadrupole: 9.2200 0.7294 -9.9494 3.5147 1.0320 1.5992
hfenergy: -578.6730564 hartree
pointgroup: C01 [X(C9H18O3)]
dipole: -0.9062754 0.0626448 0.957586 debye
polarizability: 125.1253659|2.2828523|108.058622|0.323211|-3.2691648|91.038498 unknown
InChI: InChI=1S/C9H18O3/c1-4-8(5-2)9(10)12-7-6-11-3/h8H,4-7H2,1-3H3
charge 0 multiplicity 1
30 atoms
O  -0.483889 1.04243 0.33472
O  0.737665 0.635093 -1.617334
O  -2.760685 -0.694012 -0.466068
C  1.700615 0.039247 0.580609
C  3.085607 0.667371 0.269556
C  1.740977 -1.514077 0.436693
C  0.645246 0.592609 -0.369565
C  3.141457 2.193582 0.493403
C  0.430785 -2.218978 0.848844
C  -1.66814 1.459171 -0.463325
C  -2.880418 0.678796 0.024197
C  -3.83482 -1.554997 0.024912
H  1.394795 0.295504 1.612569
H  3.836949 0.167912 0.912495
H  3.349049 0.433492 -0.779993
H  1.989956 -1.75925 -0.614285
H  2.578063 -1.884365 1.06142
H  2.445287 2.722127 -0.183525
H  4.156725 2.583606 0.296694
H  2.871689 2.457501 1.533284
H  -0.424058 -1.889564 0.230549
H  0.529621 -3.314952 0.740999
H  0.180883 -2.00288 1.905021
H  -1.806131 2.541003 -0.289064
H  -1.471198 1.269384 -1.532856
H  -3.805907 1.155598 -0.373801
H  -2.925832 0.69662 1.135298
H  -4.830571 -1.201042 -0.318906
H  -3.837739 -1.610755 1.134498
H  -3.640778 -2.55577 -0.391044
