program: Gaussian 09
title: 000227851
version: EM64L-G09RevD.01
frameworkgroup: C1[X(C9H18O2)]
method: RPBEPBE
basis: SDD
operation: Freq
keyword: #pfreq=noraman
keyword: PBEPBE/SDD
title: #p freq=noraman PBEPBE/SDD
converged: YES YES NO NO
title: Mulliken charges:
elementType: O O C C C C C C C C C H H H H H H H H H H H H H H H H H H
charge: -0.268781 -0.247626 -0.130917 -0.389202 -0.389176 0.217064 -0.699286 -0.699206 -0.232975 -0.381386 -0.679259 0.223281 0.202019 0.221745 0.221637 0.202121 0.227324 0.216129 0.211549 0.227294 0.216101 0.211649 0.219526 0.219465 0.214972 0.214992 0.212655 0.225675 0.212616
chargesum: 0.00000
title: Mulliken charges with hydrogens summed into heavy atoms:
elementType: O O C C C C C C C C C
charge: -0.268781 -0.247626 0.092364 0.034563 0.034582 0.217064 -0.044284 -0.044161 0.206015 0.048578 -0.028313
polarizability: 1.23755476e+02 7.91071545e-04 9.93289762e+01 9.21834139e-01 -3.11872331e-02 9.09014404e+01
1716.lowfreq: -20.9477 -9.3585 -7.6902 -0.0010 -0.0008 -0.0007 10.3528 42.2870 57.0941
frequency: -9.8773 42.0777 57.0471 71.7134 84.3662 97.2707 144.9486 151.5523 195.9703 212.6769 230.5288 249.9420 261.4023 303.3515 318.5104 388.9870 411.7614 488.2632 631.2156 704.6614 753.6344 773.9062 783.3895 849.3177 870.1808 876.1994 901.6118 924.8175 955.6899 1018.3239 1047.0251 1050.7221 1060.7516 1099.7608 1100.8807 1118.0624 1136.1369 1142.1621 1154.6950 1225.2941 1244.9149 1258.1530 1274.7737 1275.5137 1300.3005 1326.9233 1332.1462 1353.1229 1374.9224 1390.7787 1391.2530 1395.9624 1458.3298 1466.2469 1470.0193 1477.2227 1477.4521 1478.2950 1481.2309 1481.4787 1482.0866 1489.6892 1629.6979 2977.4817 2978.2962 2979.7249 2981.2990 2985.9378 2995.9791 3002.8829 3013.7977 3035.3720 3041.6104 3045.9460 3063.8420 3075.1807 3076.6054 3076.9050 3078.3215 3083.6935 3084.4357
redmass: 3.1988 2.1634 3.0572 2.0906 2.1351 3.8067 2.0634 2.7469 1.3328 2.1841 1.1036 1.4920 2.2495 3.5401 3.5063 3.5443 2.7349 3.9467 2.6190 3.7089 1.0783 1.3026 2.3427 1.5977 3.2361 1.1537 1.7427 2.1801 2.9269 1.7005 1.4924 2.8595 3.1386 2.4797 2.2167 2.4092 2.1911 1.4723 2.4579 1.2654 1.2843 1.2821 1.1503 1.1057 1.3187 1.4467 1.3646 1.4548 1.6080 1.2100 1.2153 1.2132 1.0752 1.0769 1.0729 1.0489 1.0480 1.0624 1.0497 1.0413 1.0553 1.0816 9.0491 1.0358 1.0354 1.0360 1.0599 1.0602 1.0594 1.0579 1.0861 1.1015 1.1019 1.0991 1.1046 1.1009 1.0995 1.0998 1.1003 1.0991 1.1044
irintensity: 0.5280 0.9786 0.1740 0.0508 0.3959 1.4698 0.0807 0.0132 0.9199 5.3546 0.0201 1.1507 1.4806 5.1875 10.6647 0.5847 1.8397 0.9588 0.0684 4.2489 5.7478 1.1503 14.5419 10.3214 7.4368 2.5341 3.8597 2.0331 74.8288 1.4837 11.0434 13.2141 2.0741 3.0509 173.7571 121.9998 1.0676 0.5378 57.1578 0.6379 0.3529 22.4718 0.1052 0.0186 0.6757 2.2459 7.3230 25.8195 8.5037 14.2828 10.7054 11.3070 0.7211 17.4821 0.8558 0.9115 17.1750 8.6495 4.6173 15.0479 20.6110 18.0740 138.0823 45.4348 16.5728 34.2694 0.1455 60.9054 2.1144 41.6165 8.1932 0.0885 0.6057 9.5562 0.1917 6.5961 84.2723 32.9408 98.4506 43.6318 89.0557
temp: 298.150 k
press: 1.00000 atm
elementType: 8 8 6 6 6 6 6 6 6 6 6 1 1 1 1 1 1 1 1 1 1 1 1 1 1 1 1 1 1
symmnumber: 1
zpe: 668572.7 jmol-1
zpe.correction: 0.254646 hartree
zpe.thermalcorrener: 0.268287 hartree
zpe.thermalcorrenthalpy: 0.269231 hartree
zpe.thermalcorrgfe: 0.213673 hartree
zpe.sumelectzpe: -503.299632 hartree
zpe.sumelectthermal: -503.285992 hartree
zpe.sumelectthermalent: -503.285047 hartree
zpe.sumelectthermalfe: -503.340605 hartree
dipole: -0.6882 0.0105 -1.6972
dipole: 1.8315
quadrupole: -60.1985 -67.6214 -75.1626
quadrupole: 0.0269 -2.2403 0.0294
quadrupole: 7.4623 0.0394 -7.5018 0.0269 -2.2403 0.0294
hfenergy: -503.5542782 hartree
pointgroup: C01 [X(C9H18O2)]
dipole: -0.2787385 -0.0068268 0.6644278 debye
polarizability: 123.7725449|0.0912981|99.3294207|-0.5267328|-0.01188|90.883927 unknown
InChI: InChI=1S/C9H18O2/c1-4-7-11-9(10)8(5-2)6-3/h8H,4-7H2,1-3H3
charge 0 multiplicity 1
29 atoms
O  -0.793371 -0.00218 0.345662
O  0.317424 0.013731 -1.70128
C  1.627819 0.000563 0.397687
C  2.456802 1.283215 0.101236
C  2.452544 -1.282844 0.09205
C  0.359055 0.005442 -0.447158
C  1.733406 2.593488 0.478343
C  1.723806 -2.593481 0.4575
C  -2.096745 0.000018 -0.386531
C  -3.204887 -0.013954 0.666919
C  -4.603994 -0.013029 0.010675
H  1.325269 -0.002952 1.462125
H  3.408439 1.208243 0.663474
H  2.715256 1.291426 -0.975359
H  2.712784 -1.283309 -0.98416
H  3.403521 -1.21584 0.656393
H  0.807131 2.72484 -0.110697
H  2.379062 3.469061 0.284082
H  1.457081 2.604323 1.549178
H  0.797925 -2.716602 -0.133885
H  2.366588 -3.469793 0.257159
H  1.445773 -2.611835 1.527778
H  -2.131948 -0.888394 -1.044662
H  -2.138345 0.900515 -1.027658
H  -3.084911 -0.908141 1.306744
H  -3.091618 0.86889 1.323514
H  -4.747896 -0.901484 -0.632159
H  -5.396622 -0.02227 0.779463
H  -4.75385 0.885354 -0.61683
