program: Gaussian 09
title: 000227829
version: EM64L-G09RevD.01
frameworkgroup: C1[X(C15H26O)]
method: RPBEPBE
basis: SDD
operation: Freq
keyword: #pfreq=noraman
keyword: PBEPBE/SDD
title: #p freq=noraman PBEPBE/SDD
converged: YES YES NO NO
title: Mulliken charges:
elementType: O C C C C C C C C C C C C C C C H H H H H H H H H H H H H H H H H H H H H H H H H H
charge: -0.451944 -0.022428 0.304059 0.221354 -0.650246 -0.253042 -0.157836 -0.461988 -0.459835 -0.586778 -0.470816 0.271465 -0.734088 -0.752416 -0.765221 -0.755323 0.183255 0.216929 0.222683 0.214704 0.192146 0.236889 0.202169 0.195380 0.199029 0.221525 0.220384 0.206840 0.220807 0.224683 0.217048 0.219348 0.216018 0.217953 0.221906 0.239630 0.216321 0.207012 0.249448 0.226092 0.215107 0.321784
chargesum: 0.00000
title: Mulliken charges with hydrogens summed into heavy atoms:
elementType: O C C C C C C C C C C C C C C C
charge: -0.130161 0.160827 0.304059 0.221354 -0.210635 -0.038339 0.034310 -0.022931 -0.065427 -0.144870 -0.043170 0.271465 -0.073010 -0.096539 -0.102258 -0.064677
polarizability: 1.75607134e+02 -4.20150047e+00 1.66868930e+02 3.64215593e+00 -2.24894217e+00 1.34764697e+02
1716.lowfreq: -18.7075 -10.1585 -0.0005 -0.0004 -0.0003 6.6664 39.3999 55.8164 73.0158
frequency: 39.2986 55.6636 72.9992 81.2447 104.8386 138.9121 188.6253 198.7039 207.3042 218.9758 224.4096 232.9950 236.6087 249.8916 300.1480 307.4086 314.4576 328.7573 343.4052 368.8566 381.9053 391.0171 450.5650 456.4087 486.8751 506.2307 536.2809 595.7408 638.2919 676.4519 716.8022 757.5884 782.5844 808.6594 819.7536 862.9684 871.3638 887.1939 913.0154 923.6852 930.5462 954.4236 957.2439 980.3479 995.9315 1000.1913 1006.6008 1022.8262 1048.8372 1061.4830 1084.4460 1098.3650 1098.9691 1112.9647 1119.1651 1150.3777 1162.3688 1166.3165 1173.6595 1192.2899 1205.1037 1224.1173 1231.9355 1249.2465 1269.5501 1275.2009 1288.2681 1296.5342 1307.9196 1311.1507 1318.9085 1325.7282 1342.1906 1350.2233 1368.1720 1371.7136 1378.5091 1378.6801 1386.2576 1395.0262 1455.0013 1456.9586 1460.2064 1462.1918 1465.5146 1468.6213 1471.1108 1474.8257 1476.9194 1478.6486 1479.3462 1486.6677 1488.2830 1681.9754 2919.1058 2945.1429 2946.1866 2948.3145 2956.0290 2964.5306 2967.7242 2971.9667 2972.9381 2976.1450 2995.1376 2995.7117 3009.2327 3012.9703 3021.8085 3036.8087 3058.1229 3065.0188 3065.3685 3067.9866 3068.5586 3076.6731 3085.5034 3092.5067 3101.0555 3532.7743
redmass: 2.9726 3.0926 2.7807 2.9303 2.4384 2.7792 1.7290 1.2175 2.3286 1.2234 2.5946 1.1383 1.6279 1.5836 2.2956 2.6146 1.3982 1.7405 2.2250 2.6394 2.7708 2.2067 2.8798 2.7924 2.8212 2.7348 2.8970 3.0065 2.4666 3.8958 2.5970 2.2778 2.8820 2.1166 2.2924 2.0578 2.2539 2.0514 2.0768 1.5262 1.8416 1.5257 1.9201 1.8264 1.6419 1.5838 2.0789 1.7569 1.5653 1.9958 1.7932 1.7783 2.1522 2.5658 1.8631 1.5662 1.8707 1.8670 1.6318 1.4461 1.6049 1.6751 1.3949 1.3424 1.3453 1.7134 1.6895 1.3388 1.4354 1.3316 1.3671 1.5870 1.6138 1.5731 1.3394 1.4698 1.2044 1.3385 1.3581 1.2817 1.0584 1.0779 1.0787 1.0756 1.0593 1.0616 1.0577 1.0721 1.0775 1.0609 1.0606 1.0536 1.0715 7.7893 1.0810 1.0693 1.0676 1.0681 1.0823 1.0678 1.0350 1.0484 1.0374 1.0528 1.0777 1.0359 1.0796 1.0988 1.0915 1.0992 1.1031 1.1003 1.0994 1.0971 1.1004 1.0994 1.0994 1.0990 1.0995 1.0656
irintensity: 0.2212 0.1209 0.8174 0.1841 0.1682 0.2490 1.8046 1.5356 0.0768 2.9676 0.2047 0.6040 2.7523 0.2203 0.6893 1.7263 55.6630 84.0876 7.1575 2.0814 6.2180 0.8035 4.6223 10.7119 4.2834 2.9113 2.9378 2.1899 1.6481 0.7596 1.6890 2.6413 5.0847 1.3143 7.0163 8.4175 11.2262 1.5113 4.4293 1.1249 15.5731 3.0051 7.7100 1.2460 6.0664 3.6644 4.5655 1.3436 3.8689 0.4094 24.9026 27.7929 7.7011 18.5121 6.1685 0.2600 10.7838 3.8013 2.5242 7.2857 24.8417 22.3088 32.9515 2.0978 21.9068 4.3283 0.8802 0.5643 5.9852 2.5691 0.6634 0.8570 0.6102 12.5456 16.7425 2.5169 6.6723 31.2226 17.6659 28.2584 2.8393 6.4765 2.3794 6.3056 4.0613 3.8050 17.8333 2.3337 4.5649 8.5884 6.8947 11.8569 14.0628 0.4367 14.4045 12.9447 28.8598 55.0438 26.0976 90.6205 30.8928 9.8645 20.7352 45.7641 28.2472 17.4030 63.3827 57.8340 33.9962 29.2947 23.8031 59.4365 51.5344 34.7196 44.7012 49.1577 4.7237 61.3820 24.7882 5.8308
temp: 298.150 k
press: 1.00000 atm
elementType: 8 6 6 6 6 6 6 6 6 6 6 6 6 6 6 6 1 1 1 1 1 1 1 1 1 1 1 1 1 1 1 1 1 1 1 1 1 1 1 1 1 1
symmnumber: 1
zpe: 986490.1 jmol-1
zpe.correction: 0.375734 hartree
zpe.thermalcorrener: 0.393614 hartree
zpe.thermalcorrenthalpy: 0.394559 hartree
zpe.thermalcorrgfe: 0.331346 hartree
zpe.sumelectzpe: -661.118661 hartree
zpe.sumelectthermal: -661.100780 hartree
zpe.sumelectthermalent: -661.099836 hartree
zpe.sumelectthermalfe: -661.163049 hartree
dipole: -1.3051 -0.8107 -0.4566
dipole: 1.6028
quadrupole: -109.4535 -99.0805 -97.3111
quadrupole: -4.2467 -0.8054 0.1616
quadrupole: -7.5051 2.8679 4.6372 -4.2467 -0.8054 0.1616
hfenergy: -661.4943948 hartree
pointgroup: C01 [X(C15H26O1)]
dipole: 0.5211748 -0.3055158 0.1807952 debye
polarizability: 175.4468052|4.4383672|167.1064464|3.3679632|1.9524943|134.6875088 unknown
InChI: InChI=1S/C15H26O/c1-10-5-7-12(15(3,4)16)9-14-11(2)6-8-13(10)14/h10-12,16H,5-9H2,1-4H3
charge 0 multiplicity 1
42 atoms
O  -3.826744 0.210499 0.887209
C  -1.420119 0.011221 0.291984
C  1.105015 -0.548268 0.018201
C  1.741044 0.636924 0.260083
C  -0.317638 -0.789055 -0.459884
C  2.058639 -1.740089 0.181164
C  1.221013 2.05478 0.064843
C  -1.374856 1.525304 -0.045586
C  -0.212839 2.304134 0.615237
C  3.200085 0.406732 0.65598
C  3.277519 -1.123039 0.937001
C  -2.857392 -0.585939 0.071233
C  2.444015 -2.350884 -1.194293
C  1.353797 2.479953 -1.427174
C  -2.957071 -2.059515 0.533575
C  -3.377018 -0.427984 -1.368008
H  -1.213393 -0.093654 1.38272
H  -0.399655 -0.555666 -1.543734
H  -0.521591 -1.872541 -0.36826
H  1.585126 -2.543075 0.784575
H  1.888394 2.728044 0.644794
H  -2.328048 1.97569 0.29147
H  -1.338823 1.65793 -1.145581
H  -0.421512 3.389112 0.508625
H  -0.214441 2.089803 1.70386
H  3.881633 0.712304 -0.166959
H  3.493244 1.010126 1.537795
H  4.237387 -1.570561 0.621254
H  3.167497 -1.300858 2.022978
H  2.962237 -1.600395 -1.820334
H  3.116666 -3.219749 -1.066962
H  1.550257 -2.694013 -1.748783
H  1.029846 3.528987 -1.566715
H  2.402012 2.397143 -1.767992
H  0.737634 1.840388 -2.083993
H  -4.021775 -2.348552 0.581447
H  -2.449011 -2.752934 -0.159418
H  -2.511846 -2.196234 1.538746
H  -3.439868 0.637168 -1.644847
H  -4.390122 -0.858964 -1.448439
H  -2.717444 -0.945249 -2.086796
H  -3.571852 0.11488 1.841884
