program: Gaussian 09
title: 000227827
version: EM64L-G09RevD.01
frameworkgroup: C1[X(C16H15ClN2O4S)]
method: RPBEPBE
basis: SDD
operation: Freq
keyword: #p
keyword: freq=noraman
keyword: PBEPBE/SDD
title: #p freq=noraman PBEPBE/SDD
converged: YES YES NO NO
title: Mulliken charges:
elementType: Cl S O O O O N N C C C C C C C C C C C C C C C C H H H H H H H H H H H H H H H
charge: -0.068572 0.866756 -0.541278 -0.530581 -0.240416 -0.247124 -0.440293 -0.445191 -0.092724 -0.093278 -0.213255 -0.231874 -0.229895 -0.217891 0.507609 0.506315 -0.431047 -0.326018 -0.328962 -0.431019 0.255507 0.220856 -0.669014 -0.796764 0.282351 0.278726 0.275811 0.281754 0.238887 0.315074 0.319005 0.229944 0.325705 0.314267 0.302275 0.301505 0.238728 0.273281 0.240840
chargesum: 0.00000
title: Mulliken charges with hydrogens summed into heavy atoms:
elementType: Cl S O O O O N N C C C C C C C C C C C C C C C C
charge: -0.068572 0.866756 -0.541278 -0.530581 -0.240416 -0.247124 -0.114588 -0.130924 -0.092724 -0.093278 0.069096 0.046853 0.045917 0.063862 0.507609 0.506315 -0.192161 -0.010944 -0.009957 -0.201075 0.255507 0.220856 -0.065235 -0.043915
polarizability: 3.41543661e+02 8.83324432e+00 1.95588042e+02 2.13238770e+00 -1.39455226e+01 2.25034664e+02
1716.lowfreq: -85.0160 -2.6621 -0.0013 -0.0006 0.0019 2.4918 3.6501 13.3426 21.3388
frequency: -85.0120 13.2854 21.2049 26.6480 45.8707 58.7506 72.9550 74.3784 79.2738 86.5749 97.8123 131.3605 142.1326 160.0927 183.0733 187.7885 208.1737 237.0562 277.6893 307.2089 320.9627 330.0460 354.6092 363.2114 383.1776 409.9597 413.2443 414.3043 421.3445 460.1913 508.4739 525.4555 535.3756 559.9640 572.1965 582.8987 618.5192 620.1790 649.5069 672.6444 679.6309 684.2078 730.2038 731.5480 742.7307 780.8538 817.2995 836.5650 839.3503 843.6540 869.1886 875.1721 906.7480 920.2360 930.3152 942.2258 960.6882 965.5388 982.6945 990.1553 992.5592 995.4224 998.3288 1032.6462 1052.7314 1058.6683 1118.0179 1122.9110 1152.7694 1180.3979 1184.7850 1208.9026 1217.4434 1258.4554 1262.7543 1267.4353 1293.8491 1298.9006 1369.0947 1377.6536 1384.2544 1403.3634 1405.1746 1420.0710 1446.9665 1467.4037 1476.2496 1478.7875 1505.4260 1532.4780 1596.5523 1598.1124 1601.5210 1605.1925 1613.5554 1640.5214 2989.1142 3071.3070 3073.9673 3121.9349 3127.9732 3138.8914 3153.5752 3153.9369 3156.0962 3159.7093 3162.2000 3195.2316 3198.0571 3451.8698 3521.2182
redmass: 1.0355 9.1148 7.4404 5.4453 5.3930 4.0288 5.8586 5.3303 7.6098 3.3862 7.6382 11.0209 5.1846 7.2169 6.6285 8.0940 7.2727 9.2081 7.6542 5.4482 8.7599 6.4831 6.2655 4.8600 8.3909 6.3213 2.9498 3.0216 7.9693 7.1767 4.3526 3.1650 3.2897 4.9780 3.0309 2.9160 7.0832 7.0411 1.1900 6.2533 6.5035 6.4175 2.1454 3.4133 1.4498 13.8364 4.5309 1.4072 4.5759 1.4019 1.4604 1.4844 1.7264 12.3601 7.1387 6.5198 1.3785 1.3913 1.9412 3.6348 4.3863 1.3502 1.3457 1.6714 2.4007 2.4341 1.3003 1.3074 1.1109 1.1282 1.1256 4.1637 3.4593 1.2344 1.8773 1.8204 1.4130 1.4030 3.9892 1.2574 5.0788 4.4148 4.8892 1.1042 1.1288 1.0466 2.3576 2.3531 2.0460 2.2742 6.5814 6.1013 5.6092 5.5223 5.8315 5.1641 1.0385 1.0565 1.0983 1.0899 1.0901 1.0979 1.1093 1.0911 1.0911 1.0951 1.0953 1.0952 1.0950 1.0766 1.0765
irintensity: 0.0499 0.0429 0.4755 4.5783 3.2824 0.7060 4.8246 0.9026 2.0697 15.5691 1.7136 3.0609 3.8225 1.0250 2.4405 0.5518 7.5245 21.3672 13.6922 12.2772 10.6176 2.2640 6.4744 12.1694 0.9103 0.0050 0.0064 0.1216 5.3374 29.3118 17.5616 47.7739 118.5954 138.9149 31.2856 3.7594 2.0743 3.8054 61.2266 1.7082 27.4364 77.6805 15.0145 2.4594 27.5466 109.5599 7.8768 23.0132 11.5631 29.1253 29.6879 62.3087 12.7350 60.0885 13.2930 1.1868 3.8314 0.6725 21.7034 8.9895 0.1719 2.2693 3.3050 8.2569 70.5720 18.2539 3.1931 24.1212 0.4625 56.9105 4.2569 8.1772 62.8697 20.6887 65.0056 19.8696 54.3943 13.8587 229.4763 84.3065 125.3055 10.6508 29.4313 16.6219 45.1497 20.5528 88.9883 17.5513 453.5902 550.2505 133.9510 129.5634 14.4842 41.2566 101.0141 121.1417 6.8202 2.7198 13.1563 16.6349 10.9917 6.1910 0.3685 1.5315 1.5180 9.0426 5.2850 5.3783 8.8608 99.2383 14.3764
temp: 298.150 k
press: 1.00000 atm
elementType: 17 16 8 8 8 8 7 7 6 6 6 6 6 6 6 6 6 6 6 6 6 6 6 6 1 1 1 1 1 1 1 1 1 1 1 1 1 1 1
symmnumber: 1
zpe: 744382.5 jmol-1
zpe.correction: 0.283520 hartree
zpe.thermalcorrener: 0.306425 hartree
zpe.thermalcorrenthalpy: 0.307370 hartree
zpe.thermalcorrgfe: 0.227240 hartree
zpe.sumelectzpe: -1885.366765 hartree
zpe.sumelectthermal: -1885.343859 hartree
zpe.sumelectthermalent: -1885.342915 hartree
zpe.sumelectthermalfe: -1885.423045 hartree
dipole: -0.4246 -6.2756 -6.1127
dipole: 8.7709
quadrupole: -117.3154 -178.3990 -154.9934
quadrupole: 12.5847 20.8464 5.5474
quadrupole: 32.9206 -28.1631 -4.7575 12.5847 20.8464 5.5474
hfenergy: -1885.650285 hartree
pointgroup: C01 [X(C16H15Cl1N2O4S1)]
dipole: -0.4392579 -1.8205796 -2.8982885 debye
polarizability: 341.7608369|2.2839292|203.3179016|-5.656299|-19.5110107|217.087629 unknown
InChI: InChI=1S/C16H15ClN2O4S/c1-11(20)18-12-2-6-14(7-3-12)24(22,23)15-8-4-13(5-9-15)19-16(21)10-17/h2-9,18-19H,10H2,1H3
charge 0 multiplicity 1
39 atoms
Cl 6.973238 -1.597936 -2.411836
S  -0.453659 2.394294 0.626963
O  -0.500729 3.639914 -0.439803
O  -0.472753 2.588493 2.252859
O  5.160316 -1.883401 1.227222
O  -5.617042 -2.403231 1.104286
N  4.650197 -0.654572 -0.723632
N  -5.228801 -1.1085 -0.817427
C  1.110807 1.410492 0.219445
C  -1.905665 1.267083 0.191363
C  1.683419 1.57474 -1.052082
C  1.682034 0.609725 1.21972
C  -2.406013 0.396836 1.171903
C  -2.480898 1.395967 -1.083071
C  3.457577 0.02719 -0.35659
C  -4.108624 -0.327335 -0.430205
C  2.867036 0.870098 -1.338988
C  2.867697 -0.097906 0.931774
C  -3.515396 -0.416274 0.861208
C  -3.589076 0.586473 -1.391577
C  5.403061 -1.526751 0.035327
C  -5.923778 -2.077898 -0.076873
C  6.655788 -2.123015 -0.616134
C  -7.090708 -2.706266 -0.83705
H  1.228602 2.25611 -1.778212
H  1.225099 0.561331 2.213722
H  -1.956572 0.373172 2.170239
H  -2.087337 2.129627 -1.7940
H  3.339021 0.979392 -2.322895
H  3.339832 -0.73219 1.683838
H  -3.932241 -1.106844 1.595631
H  -4.059861 0.669482 -2.379203
H  5.004047 -0.486274 -1.673615
H  -5.575849 -0.937749 -1.764732
H  7.546345 -1.815816 -0.048606
H  6.573993 -3.219427 -0.629815
H  -6.746717 -3.206333 -1.761408
H  -7.568786 -3.453491 -0.188269
H  -7.843305 -1.945712 -1.116377
