program: Gaussian 09
title: 000227823
version: EM64L-G09RevD.01
frameworkgroup: C1[X(C11H10N2O3)]
method: RPBEPBE
basis: SDD
operation: Freq
keyword: #p
keyword: freq=noraman
keyword: PBEPBE/SDD
title: #p freq=noraman PBEPBE/SDD
converged: YES YES NO YES
title: Mulliken charges:
elementType: O O O N N C C C C C C C C C C C H H H H H H H H H H
charge: -0.260652 -0.210189 -0.156760 0.027630 0.007374 0.346357 -0.191527 0.356710 0.379104 -0.555454 0.352215 -0.519020 -0.340439 -0.803941 -0.366345 -0.535936 0.270031 0.288736 0.234535 0.240270 0.236345 0.240182 0.248037 0.252030 0.228675 0.232031
chargesum: 0.00000
title: Mulliken charges with hydrogens summed into heavy atoms:
elementType: O O O N N C C C C C C C C C C C
charge: -0.260652 -0.210189 -0.156760 0.027630 0.007374 0.346357 -0.191527 0.356710 0.379104 -0.285424 0.352215 -0.230284 -0.105904 -0.087143 -0.118309 0.176800
polarizability: 2.17420248e+02 -7.51342434e+00 1.73942372e+02 -4.10825758e+00 6.64199279e-03 7.37442649e+01
1716.lowfreq: 0.0008 0.0009 0.0010 1.1129 5.4739 8.9790 50.3815 66.7614 82.4254
frequency: 50.3762 66.7603 82.4243 136.8829 148.6727 166.3228 176.7473 183.3443 205.8186 237.8945 274.8868 316.3373 320.7247 370.1535 396.9235 444.2041 477.8270 513.3904 523.7579 545.6672 561.4752 628.2321 649.8943 695.9316 700.2853 753.0001 805.8546 833.2368 850.8031 867.2451 888.5319 897.1230 898.4162 962.0015 986.5680 1013.6510 1046.1425 1081.4814 1085.9476 1112.5057 1154.3982 1197.8955 1210.0153 1222.1453 1235.9538 1275.4684 1328.3390 1365.0671 1373.2393 1384.0352 1401.2202 1426.0784 1437.6224 1455.5201 1469.8201 1469.8989 1472.7017 1476.1398 1500.8346 1548.9112 1592.1852 1628.5041 2969.7356 2978.6796 3054.9558 3062.6098 3096.7025 3128.2137 3134.4290 3154.9634 3170.4534 3180.8514
redmass: 8.9540 5.0430 3.7520 4.3584 5.6948 1.2973 3.1875 3.6507 1.8071 1.6925 3.4684 6.0052 4.1299 6.0611 7.0044 4.0857 4.8393 6.0442 4.8703 4.7973 4.5500 4.3812 3.4214 5.6348 11.4098 6.4239 3.9599 4.7668 1.2734 7.6952 1.5686 2.2659 3.7114 1.4340 1.8666 4.3480 1.5763 1.9183 2.5118 1.2558 1.4024 2.1349 2.6455 5.2052 2.1041 2.9879 3.3457 4.5854 2.2541 7.4801 1.2614 2.4926 1.8118 2.0413 1.0483 1.0479 1.0792 1.1769 5.3391 7.2948 5.8816 7.2140 1.0327 1.0381 1.0972 1.1047 1.0983 1.0890 1.1001 1.0961 1.0914 1.0913
irintensity: 1.0047 1.1187 4.8678 2.6647 3.2102 0.7140 3.5399 0.4368 1.6412 1.2554 1.2210 1.1201 4.6371 2.9965 0.2854 1.8418 1.8556 3.3984 2.7234 11.1467 0.4201 2.2417 1.2607 4.8531 38.6493 6.3001 4.9776 2.3326 22.5013 7.1629 7.7077 28.3716 21.3426 0.0375 3.6201 72.7214 6.8803 4.6133 17.1156 0.0966 0.7588 74.0636 68.4404 205.9468 8.0772 120.0481 4.6552 23.0156 10.8700 118.9126 21.9960 12.3362 14.6101 51.4777 0.4133 31.3970 30.0842 10.8479 73.8448 51.8502 30.2483 118.4967 61.7591 18.1036 13.5139 38.4949 19.0368 11.6061 19.4532 29.6171 2.2689 0.8799
temp: 298.150 k
press: 1.00000 atm
elementType: 8 8 8 7 7 6 6 6 6 6 6 6 6 6 6 6 1 1 1 1 1 1 1 1 1 1
symmnumber: 1
zpe: 505512.1 jmol-1
zpe.correction: 0.192539 hartree
zpe.thermalcorrener: 0.206604 hartree
zpe.thermalcorrenthalpy: 0.207548 hartree
zpe.thermalcorrgfe: 0.151494 hartree
zpe.sumelectzpe: -759.102871 hartree
zpe.sumelectthermal: -759.088806 hartree
zpe.sumelectthermalent: -759.087862 hartree
zpe.sumelectthermalfe: -759.143916 hartree
dipole: -0.9659 -6.5704 0.0910
dipole: 6.6417
quadrupole: -68.3392 -106.0404 -95.8864
quadrupole: -6.1866 2.5369 -0.5464
quadrupole: 21.7495 -15.9517 -5.7978 -6.1866 2.5369 -0.5464
hfenergy: -759.2954101 hartree
pointgroup: C01 [X(C11H10N2O3)]
dipole: 0.2961773 -2.5961697 -0.010167 debye
dipolederiv: -1.5243159 -0.569691 -0.0106436 -0.9077898 -0.6845733 -0.0044176 -0.0112749 0.0062613 -0.2962156 -0.6136964 0.2471231 0.2856724 0.2627055 -0.5764096 -0.0509726 0.253316 -0.0186099 -0.4554864 -0.273949 0.0119374 0.1641421 0.0170674 -0.688751 0.224925 0.216569 0.1120387 -0.4490269 -0.3551451 0.0512437 0.0004085 0.0539569 -0.2314816 -0.0183015 -0.0457344 -0.0163204 -0.1895941 0.6646944 -0.3318143 -0.5293982 -0.512239 1.4114526 -0.1956755 -0.4852783 -0.0990803 0.7035128 0.0670737 0.1955559 -0.0028739 0.2258767 -0.1311829 -0.0090336 0.0154244 -0.0189788 0.046792 0.1276621 0.0113348 0.0429967 -0.0183119 -0.140906 0.0073609 0.0049548 0.0976305 0.0123592 0.1391875 -0.0963393 0.0050888 -0.2099941 0.4463652 0.0108314 -0.0061138 0.0074193 -0.0211809 0.3019159 -0.0046472 0.0729353 0.3084004 -0.2675534 0.0367066 0.0194102 0.0276825 0.0301366 -0.3755848 -0.3339248 -0.0068248 -0.0163384 -0.0260797 0.0119842 0.0102969 0.0044103 -0.1692127 0.9126425 0.782819 0.0103373 1.2464201 0.6206448 0.0014847 0.0218537 -0.0202895 0.1110125 -0.2344078 0.074668 -0.0122337 -0.559976 -0.1016363 0.0066679 0.0154238 -0.0947532 -0.1509117 0.0479502 -0.1092576 -0.002636 -0.1184847 -0.364272 -0.0186143 -0.0269628 -0.0149517 -0.1190636 0.0639633 0.0022624 -0.0011889 0.0697596 -0.1844622 -0.0063344 0.011556 -0.0055505 0.0477659 0.1798316 -0.0051459 0.0093468 0.14442 0.4302103 0.0305597 0.0246022 0.0187869 -0.0447736 0.9724632 0.2134811 0.0054223 -0.1262185 0.1739625 -0.0051417 -0.0097587 -0.00814 0.3129229 0.1080316 0.0375396 -0.001081 0.0011534 -0.0268141 -0.0058256 -0.0093677 0.006763 0.1557888 0.0211418 0.0167636 -0.0062226 0.0380264 0.1222861 -0.0052496 0.0075689 0.0239365 0.1604718 -0.1138828 0.0444755 -0.0038159 0.0774593 0.0820145 -0.0021542 -0.0034522 -0.0011082 0.1530164 0.082107 -0.0383314 -0.0884589 0.0115025 0.0146582 -0.0598999 -0.0430934 -0.0904311 -0.0331167 -0.1543897 0.0788122 -0.0015662 -0.0403065 0.0848929 -0.0015388 -0.0050463 -0.0005833 0.1109495 0.0806307 -0.047792 0.0899564 0.0040335 0.0065562 0.060933 0.0466793 0.0906693 -0.0190496 -0.0466506 -0.0898957 -0.0131907 -0.1043447 -0.0083403 -0.0114262 -0.0019298 -0.0114587 0.1254237 -0.0029494 -0.0832843 -0.0001006 -0.1402466 -0.0608068 0.0001101 -0.0004643 -0.0007692 0.1270042 -0.0409143 -0.0272162 -0.0091197 0.1497355 0.0474666 0.1167807 -0.0601598 0.0878431 -0.0746072 -0.0334098 -0.0306766 0.0030479 0.1437332 0.052759 -0.1137586 0.0609812 -0.0824167 -0.0749173 unknown
polarizability: 217.8357449|6.0473679|173.4942573|-4.5770102|-0.9086767|73.7768822 unknown
InChI: InChI=1S/C11H10N2O3/c1-7-3-4-12-11-9(7)5-8(16-2)6-10(11)13(14)15/h3-6H,1-2H3
charge 0 multiplicity 1
26 atoms
O  -2.381033 -2.409094 -0.03381
O  -2.19641 2.71924 0.701234
O  -0.629942 3.173451 -0.898456
N  1.570219 1.624765 0.098095
N  -1.211105 2.382776 -0.072476
C  0.946316 -0.79238 -0.01333
C  0.618726 0.623961 0.006111
C  2.349053 -1.159168 0.004739
C  -0.77495 0.965206 -0.022076
C  -0.094696 -1.762886 -0.039802
C  -1.442952 -1.374704 -0.023837
C  -1.791066 0.008582 -0.00381
C  3.286282 -0.123761 0.064947
C  2.776659 -2.610488 -0.031711
C  2.857705 1.241236 0.127978
C  -3.805461 -2.050648 -0.002136
H  0.132496 -2.832072 -0.0653
H  -2.829713 0.3475 0.018888
H  4.358177 -0.346749 0.080021
H  2.405735 -3.118633 -0.941807
H  3.875385 -2.697241 -0.018537
H  2.381006 -3.170267 0.836815
H  3.598117 2.045547 0.20934
H  -4.338843 -3.011749 -0.005844
H  -4.090458 -1.462382 -0.895091
H  -4.05645 -1.487343 0.916552
