program: Gaussian 09
title: 000227814
version: EM64L-G09RevD.01
frameworkgroup: C1[X(C21H18O3)]
method: RPBEPBE
basis: SDD
operation: Freq
keyword: #pfreq=noraman
keyword: PBEPBE/SDD
title: #p freq=noraman PBEPBE/SDD
converged: YES YES NO NO
title: Mulliken charges:
elementType: O O O C C C C C C C C C C C C C C C C C C C C C H H H H H H H H H H H H H H H H H H
charge: -0.459533 -0.397340 -0.258866 -0.002490 -0.441221 0.398426 0.395053 0.524129 0.172958 -0.394979 -0.401975 -0.379173 -0.378903 -0.428541 -0.374739 -0.241995 -0.263805 -0.222443 -0.225794 -0.226055 -0.243372 -0.242278 -0.240587 -0.243085 0.258477 0.367412 0.248399 0.248964 0.282481 0.276645 0.231384 0.246176 0.222921 0.226581 0.223660 0.226467 0.225884 0.225205 0.225510 0.229124 0.227778 0.383541
chargesum: 0.00000
title: Mulliken charges with hydrogens summed into heavy atoms:
elementType: O O O C C C C C C C C C C C C C C C C C C C C C
charge: -0.092121 -0.013799 -0.258866 -0.002490 -0.182745 0.398426 0.395053 0.524129 0.172958 -0.146580 -0.153011 -0.096692 -0.102258 -0.197158 -0.128563 -0.019074 -0.037224 0.001217 0.000673 -0.000171 -0.018166 -0.016768 -0.011463 -0.015307
polarizability: 2.75374427e+02 2.15488974e+01 1.99249236e+02 1.45079978e+01 -7.72298459e+00 1.95033494e+02
1716.lowfreq: -7.8566 -0.0005 0.0005 0.0006 4.7255 9.2699 32.0717 39.6611 44.5957
frequency: 32.0077 39.5763 44.5787 47.9159 55.3020 65.0490 71.9318 92.6049 120.8099 171.4972 188.5660 224.3617 232.7002 248.4255 275.7393 284.9161 308.2901 337.0081 357.7610 401.2258 402.9074 404.6283 445.9876 475.2549 495.0595 528.0987 539.7551 581.2339 601.6707 615.1606 616.4670 616.8082 628.3700 640.8841 669.7947 700.8438 702.3689 706.7815 709.6761 741.5345 760.7538 767.7420 809.8634 834.5284 847.1335 855.3591 857.8262 868.1067 914.4465 922.7368 923.6225 955.6568 961.0878 972.5160 979.6248 981.0740 989.2173 990.9478 991.3212 994.3484 998.3403 999.4873 1013.2874 1028.3933 1029.7552 1031.4219 1068.0858 1083.2318 1087.8030 1096.9801 1166.7715 1171.3528 1172.4082 1172.8635 1187.6596 1191.4327 1194.2843 1196.1946 1202.2800 1231.2014 1263.9232 1312.0026 1321.8880 1333.3444 1352.5256 1367.2066 1377.8670 1385.3568 1388.6424 1433.0893 1436.0042 1444.0889 1479.8580 1480.2995 1482.6880 1588.6326 1592.3159 1593.9047 1608.3366 1609.4286 1612.5387 1622.4178 3065.1391 3119.9637 3122.4685 3122.8538 3129.3617 3129.9207 3131.5140 3141.9048 3143.1795 3143.8994 3156.3584 3157.0776 3158.2946 3167.9416 3168.5547 3183.1277 3404.7137 3499.1092
redmass: 4.5064 4.1193 5.0442 3.8858 5.0214 4.8252 7.0452 5.7169 6.8499 6.0268 5.4284 4.8579 4.5466 4.7465 6.3125 4.8645 5.7287 8.3617 5.6316 2.8020 2.8341 2.8476 4.5605 4.1242 3.3107 3.3560 3.6714 3.0077 1.3467 5.8862 6.1195 5.3990 2.2443 2.7819 5.6051 1.9015 2.1813 1.7567 2.5124 2.3952 1.7875 2.0155 3.3301 4.9691 1.2638 1.2624 1.2551 4.3719 1.5621 1.4974 1.7388 3.1483 3.3415 1.4095 1.3899 1.4342 5.7972 5.1947 5.4055 1.4087 1.3210 1.3859 4.6061 2.1905 2.2397 2.1440 2.1441 1.6123 1.6302 1.7284 2.3718 1.0581 1.0806 1.0616 1.3563 1.4847 1.5514 1.4122 1.7158 1.4743 1.4505 1.3570 1.3419 1.5428 1.7252 1.7385 7.4929 5.7196 4.5832 2.2046 2.2190 2.1299 2.2201 2.2037 2.2152 6.0023 6.3023 6.0477 6.0513 5.9932 6.0771 7.2630 1.0839 1.0845 1.0845 1.0851 1.0882 1.0882 1.0878 1.0939 1.0932 1.0930 1.0959 1.0962 1.0993 1.0996 1.0999 1.0947 1.0656 1.0638
irintensity: 0.1239 0.3917 0.0302 0.1472 0.2066 0.5794 1.3138 0.7654 0.6432 1.2901 0.9788 0.8362 1.8871 0.2769 2.2792 0.9618 3.8701 5.0942 8.1802 0.6960 0.1873 0.0593 2.0599 2.7652 5.3620 11.0478 1.8123 94.9975 109.9780 5.0972 3.1562 5.0670 177.5955 72.8830 10.2839 58.0129 27.1279 61.3615 62.1896 71.7272 43.9619 14.3670 4.0219 1.0722 1.8868 0.5629 0.4931 7.5078 0.8446 8.9366 8.0933 11.7612 11.6622 1.0692 0.1000 0.4595 0.4885 1.6119 1.1625 0.6884 0.2309 2.3479 13.0196 7.4453 10.6754 2.8356 299.8824 8.1846 10.3100 2.4751 27.4999 0.1626 1.7393 0.3958 8.3979 1.3706 1.4757 7.8347 5.9850 6.1273 20.6917 1.6471 2.1001 33.6663 62.1814 43.7093 0.3276 7.6626 9.2636 5.2660 27.3898 9.6504 18.3693 6.9048 23.4692 2.5050 0.5994 4.8546 3.7135 20.9633 2.5983 126.6572 4.7182 1.0882 3.4384 1.9946 5.3102 2.7902 7.0709 28.5255 30.4654 30.9454 22.3071 24.4146 32.2563 20.1195 9.7980 5.4815 88.8094 29.9044
temp: 298.150 k
press: 1.00000 atm
elementType: 8 8 8 6 6 6 6 6 6 6 6 6 6 6 6 6 6 6 6 6 6 6 6 6 1 1 1 1 1 1 1 1 1 1 1 1 1 1 1 1 1 1
symmnumber: 1
zpe: 868228.3 jmol-1
zpe.correction: 0.330691 hartree
zpe.thermalcorrener: 0.351048 hartree
zpe.thermalcorrenthalpy: 0.351992 hartree
zpe.thermalcorrgfe: 0.280374 hartree
zpe.sumelectzpe: -1035.032869 hartree
zpe.sumelectthermal: -1035.012512 hartree
zpe.sumelectthermalent: -1035.011568 hartree
zpe.sumelectthermalfe: -1035.083186 hartree
dipole: -0.0422 -0.6644 -2.0650
dipole: 2.1696
quadrupole: -124.9380 -132.2117 -134.5359
quadrupole: 4.1597 4.3275 0.9400
quadrupole: 5.6239 -1.6499 -3.9740 4.1597 4.3275 0.9400
hfenergy: -1035.3635601 hartree
pointgroup: C01 [X(C21H18O3)]
dipole: -0.0408095 0.2285423 -0.8214239 debye
polarizability: 267.7246914|29.8933219|206.3050862|-18.7396492|4.4955001|195.62738 unknown
InChI: InChI=1S/C21H18O3/c22-20(23)19(16-10-4-1-5-11-16)21(24,17-12-6-2-7-13-17)18-14-8-3-9-15-18/h1-15,19,22,24H
charge 0 multiplicity 1
42 atoms
O  0.272998 0.411763 1.85275
O  -0.104505 3.138231 -1.493476
O  0.13972 3.006252 0.802428
C  0.533317 0.084268 0.445907
C  -0.420034 0.960583 -0.481047
C  0.181847 -1.403014 0.259016
C  2.028752 0.340179 0.130317
C  -1.915193 0.715577 -0.235696
C  -0.098697 2.434939 -0.294556
C  0.60506 -2.099008 -0.900649
C  2.501038 0.822224 -1.116826
C  -0.602226 -2.078489 1.223749
C  2.976431 0.026268 1.13904
C  -2.643525 -0.065039 -1.167832
C  -2.587458 1.236101 0.89896
C  0.239902 -3.448615 -1.098839
C  3.886316 0.993389 -1.346262
C  -0.958762 -3.431813 1.029576
C  4.357783 0.19373 0.910409
C  -4.015625 -0.33126 -0.968548
C  -3.96061 0.970998 1.097575
C  -0.544987 -4.120984 -0.133158
C  4.820629 0.679206 -0.335805
C  -4.679652 0.186534 0.16702
H  -0.212096 0.701308 -1.531473
H  0.383271 1.401661 1.940691
H  1.243247 -1.598918 -1.638339
H  1.805993 1.077266 -1.924238
H  -0.915971 -1.534369 2.117915
H  2.610976 -0.343877 2.101889
H  -2.131508 -0.475083 -2.046329
H  -2.043481 1.846018 1.626232
H  0.577022 -3.977421 -1.997734
H  4.231396 1.371411 -2.315385
H  -1.563683 -3.946341 1.78491
H  5.073862 -0.054362 1.702052
H  -4.563117 -0.940955 -1.695809
H  -4.468873 1.377343 1.979294
H  -0.824174 -5.170172 -0.283192
H  5.893644 0.810696 -0.514783
H  -5.745124 -0.016598 0.323042
H  0.079991 4.101574 -1.316395
