program: Gaussian 09
title: 000227808
version: EM64L-G09RevD.01
frameworkgroup: C1[X(C11H12O6)]
method: RPBEPBE
basis: SDD
operation: Freq
keyword: #pfreq=noraman
keyword: PBEPBE/SDD
title: #p freq=noraman PBEPBE/SDD
converged: YES YES NO NO
title: Mulliken charges:
elementType: O O O O O O C C C C C C C C C C C H H H H H H H H H H H H
charge: -0.275889 -0.291640 -0.306074 -0.441463 -0.249521 -0.201283 0.076198 0.326474 0.307519 0.323735 -0.534508 -0.489120 0.103809 -0.526771 0.271308 -0.527090 -0.748272 0.293778 0.297427 0.263246 0.231437 0.235636 0.256167 0.231376 0.232546 0.253815 0.247536 0.253461 0.386164
chargesum: 0.00000
title: Mulliken charges with hydrogens summed into heavy atoms:
elementType: O O O O O O C C C C C C C C C C C
charge: -0.275889 -0.291640 -0.306074 -0.055300 -0.249521 -0.201283 0.076198 0.326474 0.307519 0.323735 -0.240730 -0.191693 0.103809 0.203548 0.271308 0.192998 0.006540
polarizability: 1.92512131e+02 1.00620583e+01 1.58918427e+02 -5.52549040e+00 5.81803163e+00 8.82835286e+01
1716.lowfreq: -8.3203 -7.0327 -4.4715 -0.0006 -0.0004 -0.0001 48.5039 53.8480 55.6864
frequency: 48.4742 53.8422 55.6622 65.4809 67.4234 83.6997 104.9463 111.2794 144.2940 148.1095 155.3391 168.2916 206.3161 236.7808 271.1248 291.0781 309.0037 319.7210 357.6564 402.7054 421.9989 493.4337 528.9005 536.3447 547.0516 579.6410 595.3654 616.0622 619.8511 679.9525 704.0606 739.9212 774.5329 802.9079 866.7826 922.0738 924.4953 934.6195 947.5721 986.4756 1016.1767 1039.1923 1046.3412 1097.7727 1113.2112 1114.2144 1144.9097 1154.4712 1163.3926 1188.4825 1204.5820 1261.6250 1334.5329 1370.6411 1382.9895 1405.4819 1421.4552 1442.8385 1452.5824 1452.9665 1457.6478 1459.1984 1466.8860 1475.8353 1485.4185 1568.5974 1611.1838 1642.4384 1694.5252 2978.5549 2985.3078 3009.4800 3076.1793 3087.2537 3099.7670 3127.7867 3133.2096 3144.6162 3176.0158 3188.4535 3532.8566
redmass: 4.2770 2.3782 5.0975 4.3763 4.1723 1.5727 3.3898 3.2203 2.6886 2.4632 1.2135 1.6291 4.2565 5.2997 5.5445 3.9900 7.6013 6.3801 5.9098 6.1272 6.8331 5.4436 5.6240 2.5458 2.8231 4.6522 3.9691 2.0310 3.7452 6.1272 5.2819 5.1050 5.1793 5.8145 7.7886 1.6250 4.1293 1.8473 7.7436 2.2074 7.1888 1.6607 2.6083 1.8852 1.2426 1.2539 1.4463 1.3957 2.5935 3.2475 1.4027 2.6243 4.2132 7.9496 1.2485 2.4848 1.3955 1.5174 1.0559 1.0605 1.1201 1.1710 1.9830 1.0840 1.0528 8.5977 7.2766 8.7555 10.5634 1.0302 1.0301 1.0372 1.1052 1.1049 1.0962 1.1030 1.1038 1.1017 1.0928 1.0928 1.0642
irintensity: 1.0235 3.6225 0.9579 0.3776 3.5959 0.8041 4.1735 8.3673 1.3410 1.4156 0.2559 0.5583 5.6711 4.6128 5.1404 5.0840 4.6379 0.3052 3.6219 1.5026 0.6381 52.6744 3.4930 30.6135 24.3640 11.6779 57.4945 60.0539 23.1707 4.1796 0.9804 36.1984 42.5958 25.2990 10.5991 24.4301 124.6898 43.1322 76.3954 106.5685 241.8636 7.5064 115.1169 158.8491 6.8013 0.1861 85.9029 28.7402 313.2767 36.4724 4.5936 69.3551 322.0943 21.3101 62.6384 46.4945 12.0563 26.0237 20.7611 28.0459 15.1828 23.5488 40.8532 14.0427 23.4776 67.7582 14.5921 299.5294 158.6058 59.1064 61.9738 1.4605 24.2384 18.1221 6.3716 21.7157 15.2677 9.4776 2.7254 2.4333 52.0250
temp: 298.150 k
press: 1.00000 atm
elementType: 8 8 8 8 8 8 6 6 6 6 6 6 6 6 6 6 6 1 1 1 1 1 1 1 1 1 1 1 1
symmnumber: 1
zpe: 562438.3 jmol-1
zpe.correction: 0.214221 hartree
zpe.thermalcorrener: 0.232210 hartree
zpe.thermalcorrenthalpy: 0.233154 hartree
zpe.thermalcorrgfe: 0.167166 hartree
zpe.sumelectzpe: -876.421197 hartree
zpe.sumelectthermal: -876.403209 hartree
zpe.sumelectthermalent: -876.402264 hartree
zpe.sumelectthermalfe: -876.468253 hartree
dipole: 1.9646 2.3120 -1.3205
dipole: 3.3089
quadrupole: -84.0467 -93.9033 -99.8642
quadrupole: -4.3907 -8.5286 2.5281
quadrupole: 8.5581 -1.2986 -7.2595 -4.3907 -8.5286 2.5281
hfenergy: -876.6354185 hartree
pointgroup: C01 [X(C11H12O6)]
dipole: 0.7078703 -0.9884279 0.465507 debye
polarizability: 190.6787805|-12.7841827|160.8060553|0.9484867|7.4553397|88.2292506 unknown
InChI: InChI=1S/C11H12O6/c1-6(12)17-9-5-7(11(13)14)4-8(15-2)10(9)16-3/h4-5,13H,1-3H3
charge 0 multiplicity 1
29 atoms
O  1.852034 -1.279094 0.243638
O  1.702212 1.494389 0.438769
O  -0.606562 -2.827817 -0.073195
O  -4.319182 0.534827 0.110912
O  -3.339616 2.63168 0.304488
O  2.457622 0.957199 -1.72072
C  0.587044 -0.680533 0.197443
C  0.51117 0.737096 0.263117
C  -0.624375 -1.42041 0.047715
C  -1.918957 0.648711 0.181576
C  -0.721176 1.40309 0.260248
C  -1.866629 -0.761921 0.062223
C  -3.206275 1.387151 0.207596
C  2.048965 -2.270943 1.335412
C  2.673536 1.472355 -0.613214
C  0.031391 -3.321962 -1.320838
C  3.92495 2.170364 -0.141183
H  -0.763963 2.493335 0.333696
H  -2.78387 -1.347829 -0.031252
H  1.285252 -3.065625 1.286183
H  2.003038 -1.758096 2.313259
H  3.055451 -2.681793 1.168648
H  1.070888 -2.957448 -1.406543
H  -0.554805 -2.991454 -2.197972
H  0.009726 -4.419198 -1.243413
H  3.672736 3.117097 0.364061
H  4.592088 2.357398 -0.994725
H  4.444697 1.53077 0.594448
H  -5.14499 1.088458 0.134222
