program: Gaussian 09
title: 000227803
version: EM64L-G09RevD.01
frameworkgroup: C1[X(C18H30O3)]
method: RPBEPBE
basis: SDD
operation: Freq
keyword: #pfreq=noraman
keyword: PBEPBE/SDD
title: #p freq=noraman PBEPBE/SDD
converged: YES YES NO NO
title: Mulliken charges:
elementType: O O O C C C C C C C C C C C C C C C C C C H H H H H H H H H H H H H H H H H H H H H H H H H H H H H H
charge: -0.205287 -0.139091 -0.154484 -0.385592 -0.385210 -0.384768 -0.386001 -0.382140 -0.374125 -0.372638 -0.378409 -0.353466 -0.470356 -0.356596 -0.290004 -0.162893 -0.203664 -0.550665 -0.696540 0.176831 0.207041 0.195275 0.193493 0.193059 0.194431 0.193261 0.192665 0.193309 0.198830 0.192675 0.191918 0.197302 0.190623 0.189363 0.189099 0.197595 0.221108 0.187632 0.187968 0.203315 0.211864 0.194582 0.194699 0.277565 0.223340 0.254560 0.276497 0.277507 0.209857 0.209639 0.215025
chargesum: 0.00000
title: Mulliken charges with hydrogens summed into heavy atoms:
elementType: O O O C C C C C C C C C C C C C C C C C C
charge: -0.205287 -0.139091 -0.154484 0.003176 0.002280 0.001158 0.006139 0.002453 0.013800 0.005824 0.040295 0.022134 -0.055176 0.032684 -0.012439 0.060447 0.050896 0.003338 -0.062019 0.176831 0.207041
polarizability: 2.99449295e+02 2.70248865e+00 1.73185524e+02 8.96413156e+00 6.56470795e-01 1.53365097e+02
1716.lowfreq: -0.0015 0.0007 0.0013 0.8769 3.7257 6.8587 11.2692 16.9283 25.0172
frequency: 7.5841 16.8549 23.7380 28.5344 35.5876 47.1368 60.4807 63.7589 72.1605 91.5078 94.3555 101.7903 124.9129 129.6879 131.0458 141.7549 151.0362 154.2484 165.7747 187.4620 232.0985 242.7747 249.8293 296.3529 327.3338 355.9685 387.4809 392.3815 435.1821 455.2278 491.7111 503.1442 515.8180 558.0918 584.3047 620.6828 678.4991 718.9364 720.7100 724.7966 734.5252 754.0695 772.4802 785.6753 811.0668 825.8413 848.2460 876.4347 887.8139 889.7518 933.5332 972.3017 977.1484 980.2757 983.7721 992.4751 1010.7589 1021.2982 1024.2361 1041.2677 1046.7045 1053.4057 1067.8886 1074.7093 1079.8398 1080.6509 1084.3217 1105.6581 1121.4676 1124.4071 1135.7204 1174.8258 1181.9534 1199.7006 1199.8045 1215.6841 1226.7014 1231.5689 1250.5823 1253.7898 1258.7660 1270.1361 1275.7326 1278.8299 1282.8061 1282.8696 1287.7927 1291.7779 1296.6094 1298.1066 1301.0861 1305.9108 1322.0093 1337.2661 1345.2588 1352.3359 1354.1730 1358.2007 1358.5217 1388.6080 1440.2010 1457.5731 1459.3735 1460.1294 1462.5196 1463.6112 1465.1241 1468.8999 1473.9312 1476.8748 1478.8742 1483.4064 1487.0444 1489.2943 1683.8673 1705.1116 1772.5950 2949.1135 2949.3028 2950.7100 2951.6391 2952.4642 2955.3337 2957.1836 2959.7002 2964.0868 2968.0069 2970.9236 2971.5879 2981.6934 2984.6331 2988.7932 2994.4851 2997.1970 3002.1067 3010.7366 3017.0852 3019.7728 3024.9209 3033.7877 3041.3006 3048.0377 3068.1352 3068.4350 3070.0379 3091.6072 3098.7964
redmass: 5.7949 5.4528 3.8746 1.9068 5.1005 3.3777 2.3702 2.2107 3.3509 3.1725 1.8702 2.6391 1.8959 2.5040 10.3623 3.5349 1.9582 2.1653 2.9617 2.7489 1.1140 2.9293 4.2687 3.1279 3.8687 4.2788 5.1646 3.3609 3.0708 3.8854 3.0067 3.2369 2.9594 4.5297 9.8273 3.9142 6.3715 1.0587 1.0654 1.0792 1.1080 1.1556 3.9112 1.2473 4.5973 1.5524 1.7809 1.8778 1.9083 1.5461 1.2948 1.4626 2.0614 3.9665 1.4355 3.7115 2.4583 2.7534 1.6050 2.0501 2.7324 2.1986 2.8165 2.4549 2.1684 2.2254 2.4266 5.6667 2.4700 2.4363 1.8135 1.7760 1.8177 1.2551 1.5807 1.3468 1.3563 1.3066 1.3043 1.2936 1.2943 1.2334 1.2905 1.0306 1.1799 1.3324 1.0979 1.1064 1.1248 1.1123 1.3050 1.2154 1.3578 1.4233 1.4917 1.5516 1.7068 1.6312 1.6190 1.2177 1.0779 1.0859 1.0744 1.0759 1.0709 1.0712 1.0685 1.0861 1.0859 1.0427 1.0869 1.0907 1.0939 1.0948 7.0089 11.9129 12.8567 1.0585 1.0586 1.0589 1.0591 1.0593 1.0596 1.0610 1.0594 1.0589 1.0586 1.0614 1.0365 1.0960 1.0968 1.0980 1.0997 1.0828 1.1014 1.1012 1.1013 1.0652 1.1041 1.1046 1.1043 1.1034 1.1006 1.0934 1.0993 1.0896 1.0978
irintensity: 0.7500 0.0206 0.5112 0.4270 1.5262 1.7248 1.5874 0.3238 1.1115 0.1249 0.2951 0.2629 0.1698 0.1101 2.3428 0.0768 0.0671 0.0172 0.0669 1.9217 0.0005 0.0238 1.7418 3.1263 3.4745 2.5534 5.8442 3.1877 4.6085 2.6094 1.8985 0.6382 1.4815 15.6330 4.3726 23.1414 35.2679 18.3018 1.1965 7.5025 0.4731 4.3608 5.1304 5.6126 217.5398 41.1542 30.6679 44.5268 5.0632 14.0808 1.3587 23.8864 11.6621 10.1124 19.6422 124.3464 15.9146 4.0590 0.4059 8.7227 36.4184 3.6257 0.3966 2.4497 0.5583 0.0297 1.2168 149.8749 9.6710 13.0570 29.1803 9.0224 1.4378 25.1871 0.1255 0.6361 0.3960 0.6982 0.6877 0.5121 0.2322 0.5995 0.6239 0.1915 0.0488 0.4743 0.1956 0.3208 0.1058 0.0336 0.9875 0.3280 0.6505 1.5404 0.8437 0.9601 0.2997 0.1058 0.0810 11.2280 19.2803 2.3777 0.0049 0.7086 0.1588 0.4463 0.2391 1.1229 1.0754 12.3072 2.1579 3.1189 5.2051 39.4307 80.4790 454.0276 114.7117 0.0023 0.1147 0.1981 0.4938 0.2502 2.4683 18.0239 0.3558 66.2209 164.5983 139.1733 38.9918 0.4094 0.7758 1.1444 1.1045 5.3124 1.2007 1.5171 2.6842 4.0207 2.3290 2.9299 134.8085 200.3461 91.7735 42.4377 55.8904 20.7038 5.8031
temp: 298.150 k
press: 1.00000 atm
elementType: 8 8 8 6 6 6 6 6 6 6 6 6 6 6 6 6 6 6 6 6 6 1 1 1 1 1 1 1 1 1 1 1 1 1 1 1 1 1 1 1 1 1 1 1 1 1 1 1 1 1 1
symmnumber: 1
zpe: 1162590.4 jmol-1
zpe.correction: 0.442807 hartree
zpe.thermalcorrener: 0.468059 hartree
zpe.thermalcorrenthalpy: 0.469003 hartree
zpe.thermalcorrgfe: 0.381246 hartree
zpe.sumelectzpe: -927.907910 hartree
zpe.sumelectthermal: -927.882659 hartree
zpe.sumelectthermalent: -927.881715 hartree
zpe.sumelectthermalfe: -927.969471 hartree
dipole: 3.8126 -4.6243 1.0322
dipole: 6.0815
quadrupole: -185.6734 -139.8845 -124.4694
quadrupole: 28.2724 -8.8113 -0.6023
quadrupole: -35.6643 10.1246 25.5397 28.2724 -8.8113 -0.6023
hfenergy: -928.3507176 hartree
pointgroup: C01 [X(C18H30O3)]
dipole: 1.5098488 -1.8551965 0.0582605 debye
polarizability: 299.5751609|1.7101982|172.3173928|8.1189846|4.1721515|154.1073627 unknown
InChI: InChI=1S/C18H30O3/c1-2-3-4-5-6-7-8-9-10-11-12-13-14-16-15-17(19)21-18(16)20/h13-14,16H,2-12,15H2,1H3
charge 0 multiplicity 1
51 atoms
O  -7.597569 1.50033 0.161872
O  -5.427238 2.261879 0.569848
O  -9.453011 0.150926 -0.277153
C  4.09285 0.013363 0.242864
C  2.895459 -0.80141 -0.296095
C  5.455985 -0.465208 -0.305876
C  1.535801 -0.342048 0.277311
C  6.651951 0.36182 0.217402
C  0.336243 -1.140769 -0.280389
C  8.016644 -0.128499 -0.317345
C  -1.015714 -0.706795 0.328591
C  9.212462 0.705308 0.195454
C  -2.218683 -1.496867 -0.257289
C  10.577336 0.209426 -0.335001
C  -5.888654 -0.211856 0.480627
C  -3.525848 -1.134675 0.408266
C  -4.599289 -0.588175 -0.216795
C  -7.173399 -0.864724 -0.090149
C  11.766304 1.050358 0.178227
C  -6.183888 1.30415 0.418175
C  -8.238361 0.228502 -0.087351
H  3.950787 1.084557 -0.011789
H  4.105163 -0.042665 1.351653
H  3.047696 -1.875758 -0.060692
H  2.871119 -0.726756 -1.403533
H  5.439696 -0.423203 -1.415255
H  5.603793 -1.532592 -0.038159
H  1.555968 -0.434881 1.383425
H  1.390778 0.736518 0.059301
H  6.510421 1.42701 -0.061848
H  6.661518 0.331057 1.327227
H  0.298518 -1.022434 -1.383443
H  0.494261 -2.223091 -0.08877
H  8.004268 -0.106102 -1.427409
H  8.161683 -1.191287 -0.030378
H  -0.984796 -0.847917 1.428808
H  -1.176312 0.375842 0.156757
H  9.224217 0.687702 1.3056
H  9.071797 1.767382 -0.096111
H  -2.021803 -2.581465 -0.121472
H  -2.284775 -1.317017 -1.347951
H  10.718522 -0.850864 -0.040871
H  10.563281 0.224364 -1.444118
H  -5.791702 -0.450771 1.55851
H  -3.579383 -1.315181 1.494977
H  -4.557558 -0.384022 -1.297237
H  -7.524719 -1.736689 0.48336
H  -7.025496 -1.200656 -1.13332
H  11.664033 2.108872 -0.127476
H  11.821236 1.02551 1.283122
H  12.729106 0.676298 -0.216305
