program: Gaussian 09
title: 000227799
version: EM64L-G09RevD.01
frameworkgroup: C1[X(C12H7N3O7)]
method: RPBEPBE
basis: SDD
operation: Freq
keyword: #p
keyword: freq=noraman
keyword: PBEPBE/SDD
title: #p freq=noraman PBEPBE/SDD
converged: YES YES NO NO
title: Mulliken charges:
elementType: O O O O O O O N N N C C C C C C C C C C C C H H H H H H H
charge: -0.241708 -0.182414 -0.159369 -0.194585 -0.188075 -0.200057 -0.198889 0.010918 0.022612 0.025566 0.234038 0.279108 0.348737 -0.282997 -0.474706 0.431921 -0.374346 -0.315841 -0.344338 0.387023 -0.337192 -0.325236 0.289622 0.335348 0.299726 0.279620 0.282396 0.295801 0.297318
chargesum: 0.00000
title: Mulliken charges with hydrogens summed into heavy atoms:
elementType: O O O O O O O N N N C C C C C C C C C C C C
charge: -0.241708 -0.182414 -0.159369 -0.194585 -0.188075 -0.200057 -0.198889 0.010918 0.022612 0.025566 0.234038 0.279108 0.348737 0.006624 -0.139358 0.431921 -0.074621 -0.036222 -0.061942 0.387023 -0.041391 -0.027918
polarizability: 3.31052651e+02 -3.98758343e+00 1.81745622e+02 2.01100233e+01 -1.20254405e+01 1.09757048e+02
1716.lowfreq: -7.1018 -4.0258 -2.1580 0.0002 0.0005 0.0009 19.1889 29.5277 36.2153
frequency: 19.1110 29.5156 36.2029 40.4120 56.6637 69.6675 101.9775 114.4397 139.2066 152.8262 183.9033 202.7881 268.9886 292.2045 301.9132 335.0262 340.3072 387.1401 408.1321 415.1558 445.3368 486.9133 492.4448 507.7835 514.8731 572.7545 610.4369 623.3947 637.0782 652.9558 664.6045 679.0639 711.0482 720.9197 733.0681 751.2856 758.8574 784.4493 830.2050 839.5583 849.5285 866.2088 888.0111 952.4244 982.2986 990.5973 994.2269 999.7012 1054.3318 1092.6808 1106.8034 1111.6064 1145.3404 1153.9243 1180.0833 1202.5387 1210.9143 1220.5897 1240.5059 1255.0999 1287.6741 1361.1345 1366.2132 1377.7490 1397.8958 1407.2865 1421.0239 1425.5116 1463.4091 1470.9164 1587.5101 1593.2355 1602.0254 1614.4254 3162.8651 3168.2662 3176.0189 3186.9733 3187.2125 3189.5827 3193.5313
redmass: 8.5490 7.6029 10.0427 14.6934 15.2732 6.7521 8.3743 8.4790 13.6391 5.5526 10.8149 10.0880 7.8947 8.2270 8.1974 9.5055 10.7030 8.7318 4.8630 3.1101 5.4261 4.7798 4.2524 7.0403 5.5263 6.5032 6.9126 7.9540 7.8575 7.3580 5.4772 7.4020 6.3260 6.6269 5.6815 6.4969 8.3099 8.6036 1.7390 2.5006 1.5307 1.6086 7.4037 1.4782 1.3357 1.3463 1.3455 2.9491 2.2684 3.2597 1.2795 3.9423 1.3825 1.8804 1.9313 10.3538 8.0010 6.6668 3.3690 1.7331 1.2697 6.2135 8.0251 11.9520 10.9555 10.0325 4.5788 5.3780 2.7070 2.5064 8.8889 6.7745 7.9277 7.2699 1.0904 1.0894 1.0899 1.0927 1.0959 1.0965 1.0976
irintensity: 3.2551 1.4880 0.9586 1.3215 0.4686 0.1868 3.4250 0.5451 2.7928 1.6569 3.1214 7.3368 1.8547 1.9797 0.6054 4.0054 3.6184 0.6674 1.1406 1.3102 6.0819 9.2528 18.3762 0.6046 2.8907 2.8616 3.4789 14.1473 3.9962 30.6386 3.4023 18.4352 12.9418 16.4909 6.8852 3.3115 30.4293 22.3059 28.3807 15.3227 36.7461 42.3408 62.5530 26.5018 3.4865 1.4761 0.2218 16.7147 52.4107 12.1378 19.3420 12.0688 14.0812 263.9320 9.3970 289.0730 952.6452 71.0771 264.3663 28.3295 1.0686 87.5704 64.4240 90.9569 43.0132 8.0243 42.3122 24.9974 290.5113 17.6357 82.7912 193.3134 98.9036 10.6518 3.2032 0.4864 0.0686 17.3681 5.3009 7.2406 4.6438
temp: 298.150 k
press: 1.00000 atm
elementType: 8 8 8 8 8 8 8 7 7 7 6 6 6 6 6 6 6 6 6 6 6 6 1 1 1 1 1 1 1
symmnumber: 1
zpe: 484789.6 jmol-1
zpe.correction: 0.184647 hartree
zpe.thermalcorrener: 0.203042 hartree
zpe.thermalcorrenthalpy: 0.203986 hartree
zpe.thermalcorrgfe: 0.134444 hartree
zpe.sumelectzpe: -1150.474263 hartree
zpe.sumelectthermal: -1150.455867 hartree
zpe.sumelectthermalent: -1150.454923 hartree
zpe.sumelectthermalfe: -1150.524465 hartree
dipole: -1.0231 -1.3022 -1.5858
dipole: 2.2929
quadrupole: -185.1089 -142.1119 -120.9814
quadrupole: -4.4363 0.4636 -3.1265
quadrupole: -35.7082 7.2888 28.4194 -4.4363 0.4636 -3.1265
hfenergy: -1150.6589092 hartree
pointgroup: C01 [X(C12H7N3O7)]
dipole: 0.3805441 -0.5827043 0.5739533 debye
polarizability: 331.0404679|-3.8682172|179.0257793|20.801999|17.5585177|112.4890731 unknown
InChI: InChI=1S/C12H7N3O7/c16-13(17)8-1-4-10(5-2-8)22-12-6-3-9(14(18)19)7-11(12)15(20)21/h1-7H
charge 0 multiplicity 1
29 atoms
O  0.231761 1.114783 0.556466
O  -3.000991 3.130257 -0.873192
O  -1.317833 3.321107 0.659781
O  -4.752832 -2.865531 0.099416
O  -5.776865 -0.862571 -0.30016
O  5.665494 -1.717702 -1.272972
O  6.369424 -0.573042 0.572642
N  -2.141089 2.632488 -0.047384
N  -4.739441 -1.582295 -0.039802
N  5.458119 -0.938263 -0.264889
C  -0.959783 0.415204 0.394623
C  -2.145562 1.154385 0.106647
C  1.498045 0.507089 0.344617
C  -1.051271 -0.992942 0.550188
C  -3.381564 0.50327 -0.05455
C  -3.436329 -0.890838 0.110972
C  -2.283949 -1.648548 0.419324
C  1.760185 -0.325705 -0.769034
C  2.514352 0.893177 1.245046
C  4.079902 -0.430254 -0.054581
C  3.068895 -0.802158 -0.968204
C  3.822994 0.417457 1.045916
H  -0.152002 -1.565296 0.793368
H  -4.279547 1.074014 -0.305491
H  -2.372619 -2.729621 0.553608
H  0.96743 -0.578561 -1.479135
H  2.266644 1.560282 2.074637
H  3.320631 -1.442761 -1.81717
H  4.6397 0.687876 1.719712
